{"text_format":"3","workbook":"xlsx","n_sheets":13,"sheets":["1. Introduction","2. Site Details","3. Desktop Assessment","4. Supporting Information","5. Area Habitats","6. Hedges & Lines of Trees","7. Watercourses","8. Headline Results","9. All Habitats + Multipliers","10. Condition and Temporal","11. Lists","12. Version history","13. Habitats Translation"],"not_rendered":{"charts":1,"images":8,"macros":1,"external_links":1,"defined_names":53},"read":"whole","date_system":"1900"}

{"sheet":"1. Introduction","index":0,"n_rows":29,"n_cols":10,"rows_kept":29,"merged":[[0,3,4,9],[5,1,7,9],[8,1,9,9],[10,1,10,4],[10,5,10,9],[11,1,11,9],[13,1,14,1],[13,2,14,9],[16,1,16,7],[18,1,19,2],[18,3,19,7],[20,1,21,2],[20,3,21,7],[22,1,23,2],[22,3,23,7],[24,3,24,7],[25,3,25,7],[26,1,26,2],[26,3,26,7],[27,1,27,2],[27,3,27,7],[27,9,27,17],[28,1,28,2],[28,3,28,7]]}
[]
[]
[]
[]
[]
["created by Sam Arthur @ FPCR","Small Sites Metric \n(The Statutory Biodiversity Metric) \n"]
{"$rows_left_out":24}
{"sheet":"2. Site Details","index":1,"n_rows":23,"n_cols":5,"rows_kept":23,"merged":[[1,1,1,2],[2,1,2,2],[3,1,3,2],[4,1,4,2],[5,1,5,2],[6,1,6,2],[7,1,7,2],[8,1,8,2],[9,1,9,2],[10,1,10,2],[12,1,14,1],[12,4,12,8],[13,4,13,8],[14,4,14,8],[16,1,18,1],[16,4,16,8],[17,4,17,8],[18,4,18,8],[20,1,20,3],[21,1,21,2],[22,1,22,2]]}
[]
[null,"Sheet Name",null,"Site Details"]
[null,"1. Planning authority:",null,"East Hampshire District Council"]
[null,"2. Site name:",null," 'Glenside' 45 Windmill Lane, Alton, Hampshire GU34 2SN"]
[null,"3. Applicant:",null,"Mrs D. Schreiner, Joyce Shearman, Patricia Lee"]
[null,"4. Planning application type:",null,"Full planning consent"]
{"$rows_left_out":18}
{"sheet":"3. Desktop Assessment","index":2,"n_rows":23,"n_cols":5,"rows_kept":23,"merged":[[1,2,1,3],[2,2,2,3],[5,4,5,7],[12,2,12,3],[13,2,13,3]]}
[]
[null,"Site Name:",{"$f":"IF('2. Site Details'!D4=\"\",\"Enter site name on 2. Site Details\",'2. Site Details'!D4)","v":" 'Glenside' 45 Windmill Lane, Alton, Hampshire GU34 2SN"}]
[null,"Sheet Name","Desktop Assessment"]
[]
[null,"Development"]
[null,"14. Select the type of proposed development.\nIf Other provide details at Q.25 below","Residential",{"$f":"IF(AND(C6=\"Residential\",C9=\"Unknown number\"),\"Site area must be less than 5,000 m2\",IF(C6=\"\",\"\",\"Site area must be less than 10,000 m2\"))","v":"Site area must be less than 10,000 m2"},{"$f":"IF(AND(C9=\"Unknown number\", C6=\"Residential\"),\"Site area limited by unknown number of dwellings ⚠\", \"\")","v":""}]
{"$rows_left_out":18}
{"sheet":"4. Supporting Information","index":3,"n_rows":47,"n_cols":5,"rows_kept":47,"merged":[[1,1,1,2],[1,4,2,4],[2,1,2,2],[4,3,4,4],[7,1,8,1],[9,1,10,1],[11,1,12,1],[13,1,14,1],[15,1,16,1],[17,1,18,1],[19,1,20,1],[21,1,22,1],[23,1,24,1],[25,1,26,1],[27,1,28,1],[29,1,30,1],[31,1,32,1],[33,1,34,1],[35,1,36,1],[37,1,38,1],[39,1,40,1],[41,1,42,1],[43,1,44,1],[45,1,46,1]]}
[]
[null,"Site Name:",null,{"$f":"IF('2. Site Details'!D4=\"\",\"Enter site name on 2. Site Details\",'2. Site Details'!D4)","v":" 'Glenside' 45 Windmill Lane, Alton, Hampshire GU34 2SN"},{"$f":"IF(OR('3. Desktop Assessment'!C19=\"Walkover completed by competent person\",'3. Desktop Assessment'!C19=\"No walkover undertaken\"),IF(COUNTA(D8:E8,D10:E10,D14:E14,D16:E16,D18:E18,D22:E22,D26:E26,D30:E30,D34:E34,D38:E38,D42:E42,D46:E46,D12:E12,D20:E20,D24:E24,D28:E28,D32:E32,D36:E36,D40:E40,D44:E44)=0,\"Error - Site photographs required to support application\",\"\"),\"\")","v":""}]
[null,"Sheet Name",null,"Supporting Information"]
[]
[null,"Baseline Habitat Photos",null,"Insert photographs to support assumptions made in the metric"]
[]
{"$rows_left_out":42}
{"sheet":"5. Area Habitats","index":4,"n_rows":142,"n_cols":76,"rows_kept":142,"merged":[[0,17,31,17],[1,2,1,3],[1,5,5,7],[1,9,4,12],[2,2,2,3],[8,1,9,1],[8,2,8,4],[8,5,9,7],[8,8,8,10],[8,11,8,13],[8,14,8,15],[8,19,8,21],[8,22,8,23],[8,24,8,26],[8,27,8,29],[8,30,8,32],[8,33,9,33],[8,34,9,34],[9,3,9,4],[9,19,9,20],[10,3,10,4],[10,5,10,7],[10,19,10,20],[11,3,11,4],[11,5,11,7],[11,19,11,20],[12,3,12,4],[12,5,12,7],[12,19,12,20],[13,3,13,4],[13,5,13,7],[13,19,13,20],[14,3,14,4],[14,5,14,7],[14,19,14,20],[15,3,15,4],[15,5,15,7],[15,19,15,20],[16,3,16,4],[16,5,16,7],[16,19,16,20],[17,3,17,4],[17,5,17,7],[17,19,17,20],[18,3,18,4],[18,5,18,7],[18,19,18,20],[19,3,19,4],[19,5,19,7],[19,19,19,20],[20,3,20,4],[20,5,20,7],[20,19,20,20],[21,3,21,4],[21,5,21,7],[21,19,21,20],[22,3,22,4],[22,5,22,7],[22,19,22,20],[23,3,23,4],[23,5,23,7],[23,19,23,20],[24,3,24,4],[24,5,24,7],[24,19,24,20],[25,3,25,4],[25,5,25,7],[25,19,25,20],[26,3,26,4],[26,5,26,7],[26,19,26,20],[27,3,27,4],[27,5,27,7],[27,19,27,20],[28,3,28,4],[28,5,28,7],[28,19,28,20],[29,3,29,4],[29,5,29,7],[29,19,29,20],[30,3,30,4],[30,5,30,7],[30,19,30,20],[32,8,32,13],[33,8,33,13],[34,8,34,13],[34,17,63,17],[37,1,38,1],[37,2,37,3],[37,4,37,6],[37,7,38,7],[37,8,38,10],[37,11,38,13],[37,14,37,15],[37,19,37,21],[37,22,37,23],[37,24,37,26],[37,27,37,29],[37,30,37,31],[37,32,37,33],[38,5,38,6],[38,19,38,20],[39,5,39,6],[39,8,39,10],[39,11,39,13],[39,19,39,20],[40,5,40,6],[40,8,40,10],[40,11,40,13],[40,19,40,20],[41,5,41,6],[41,8,41,10],[41,11,41,13],[41,19,41,20],[42,5,42,6],[42,8,42,10],[42,11,42,13],[42,19,42,20],[43,5,43,6],[43,8,43,10],[43,11,43,13],[43,19,43,20],[44,5,44,6],[44,8,44,10],[44,11,44,13],[44,19,44,20],[45,5,45,6],[45,8,45,10],[45,11,45,13],[45,19,45,20],[46,5,46,6],[46,8,46,10],[46,11,46,13],[46,19,46,20],[47,5,47,6],[47,8,47,10],[47,11,47,13],[47,19,47,20],[48,5,48,6],[48,8,48,10],[48,11,48,13],[48,19,48,20],[49,5,49,6],[49,8,49,10],[49,11,49,13],[49,19,49,20],[50,5,50,6],[50,8,50,10],[50,11,50,13],[50,19,50,20],[51,5,51,6],[51,8,51,10],[51,11,51,13],[51,19,51,20],[52,5,52,6],[52,8,52,10],[52,11,52,13],[52,19,52,20],[53,5,53,6],[53,8,53,10],[53,11,53,13],[53,19,53,20],[54,5,54,6],[54,8,54,10],[54,11,54,13],[54,19,54,20],[55,5,55,6],[55,8,55,10],[55,11,55,13],[55,19,55,20],[56,5,56,6],[56,8,56,10],[56,11,56,13],[56,19,56,20],[57,5,57,6],[57,8,57,10],[57,11,57,13],[57,19,57,20],[58,5,58,6],[58,8,58,10],[58,11,58,13],[58,19,58,20],[59,5,59,6],[59,8,59,10],[59,11,59,13],[59,19,59,20],[60,8,60,10],[60,11,60,13],[61,8,61,13],[64,17,108,17],[65,1,66,1],[65,2,65,3],[65,4,65,6],[65,7,66,7],[65,8,66,8],[65,9,66,10],[65,11,66,11],[65,12,66,13],[65,14,65,15],[65,19,65,29],[65,30,66,30],[65,31,65,41],[65,42,66,42],[65,43,65,49],[66,5,66,6],[67,5,67,6],[67,9,67,10],[67,12,67,13],[68,5,68,6],[68,9,68,10],[68,12,68,13],[69,5,69,6],[69,9,69,10],[69,12,69,13],[70,5,70,6],[70,9,70,10],[70,12,70,13],[71,5,71,6],[71,9,71,10],[71,12,71,13],[72,5,72,6],[72,9,72,10],[72,12,72,13],[73,5,73,6],[73,9,73,10],[73,12,73,13],[74,5,74,6],[74,9,74,10],[74,12,74,13],[75,5,75,6],[75,9,75,10],[75,12,75,13],[76,5,76,6],[76,9,76,10],[76,12,76,13],[77,5,77,6],[77,9,77,10],[77,12,77,13],[78,5,78,6],[78,9,78,10],[78,12,78,13],[79,5,79,6],[79,9,79,10],[79,12,79,13],[80,5,80,6],[80,9,80,10],[80,12,80,13],[81,5,81,6],[81,9,81,10],[81,12,81,13],[82,5,82,6],[82,9,82,10],[82,12,82,13],[83,5,83,6],[83,9,83,10],[83,12,83,13],[84,5,84,6],[84,9,84,10],[84,12,84,13],[85,5,85,6],[85,9,85,10],[85,12,85,13],[86,5,86,6],[86,9,86,10],[86,12,86,13],[87,5,87,6],[87,9,87,10],[87,12,87,13],[88,12,88,13],[92,1,93,2],[92,3,93,3],[92,4,93,5],[92,6,93,7],[92,8,92,15],[93,8,93,10],[93,11,93,13],[93,14,93,15],[94,1,94,2],[94,4,94,5],[94,6,94,7],[94,8,94,10],[94,11,94,13],[94,14,94,15],[95,1,95,2],[95,4,95,5],[95,6,95,7],[95,8,95,10],[95,11,95,13],[95,14,95,15],[96,1,96,2],[96,4,96,5],[96,6,96,7],[96,8,96,10],[96,11,96,13],[96,14,96,15],[97,1,97,2],[97,4,97,5],[97,6,97,7],[97,8,97,10],[97,11,97,13],[97,14,97,15],[98,1,98,2],[98,4,98,5],[98,6,98,7],[98,8,98,10],[98,11,98,13],[98,14,98,15],[99,4,99,6],[101,0,103,16],[107,1,107,3],[107,4,107,8],[108,1,108,3],[108,4,108,8],[109,17,136,17],[112,1,112,3],[113,1,114,3],[115,1,116,3],[117,1,118,3],[119,1,120,3],[121,1,122,3],[123,1,124,3],[125,1,126,3],[127,1,128,3],[129,1,130,3],[131,1,132,3],[133,1,134,3],[136,1,136,4],[137,1,137,4],[137,17,168,17],[138,1,138,4],[139,1,139,4],[139,5,139,7]]}
[{"$nulls":14},"Retained Units",{"$f":"IFERROR(SUM(AE11:AE31), \"Error ▲\")","v":{"v":0.18719423999999998,"d":"0.1872"}},null,"Data beyond this column is automated"]
[null,"Site Name",{"$f":"IF('2. Site Details'!D4=\"\",\"Enter site name on 2. Site Details\",'2. Site Details'!D4)","v":" 'Glenside' 45 Windmill Lane, Alton, Hampshire GU34 2SN"},null,null,"Instructions:\n1. Enter data into 1a. Baseline habitats table \n2. Enter data on habitats to be created into 1b. Habitats to be created\n3. Enter data on habitats to be enhanced into 1c. Habitats to be enhanced \n4. Enter data on individual trees into 1d. Tree area calculator\n",{"$nulls":3},{"$f":"IFERROR(IF(OR((ISNUMBER(SEARCH(\"▲\",A7:Q101)))),\"Input Errors Present On Sheet - Red Cells Or ▲ Highlight Errors\",\"All Key Rules Satisfied ✓ \"),\"Technical Errors On Sheet ▲\")","v":"All Key Rules Satisfied ✓ "},{"$nulls":4},"Lost Units",{"$f":"IFERROR(N32, \"Error ▲\")","v":{"v":0.08643884800000001,"d":"0.0864"}}]
[null,"Sheet Name","5. Area Habitats",{"$nulls":11},"Created Units",{"$f":"IFERROR(L61, \"Error ▲\")","v":{"v":0.05469358497959577,"d":"0.0547"}}]
[{"$nulls":14},"Enhancement Units",{"$f":"IFERROR(L89, \"Error ▲\")","v":{"v":0,"d":"0.0000"}}]
[{"$nulls":14},"Net Change",{"$f":"IFERROR((P1+L61+L89)-L32, \"Error ▲\")","v":{"v":-0.0317452630204042,"d":"-0.0317"}}]
[]
{"$rows_left_out":137}
{"sheet":"6. Hedges & Lines of Trees","index":5,"n_rows":117,"n_cols":76,"rows_kept":117,"merged":[[0,17,30,17],[1,2,1,3],[1,5,5,7],[1,9,4,12],[2,2,2,3],[8,1,9,1],[8,2,8,4],[8,5,9,7],[8,8,8,10],[8,11,8,13],[8,14,8,15],[8,19,8,21],[8,22,8,23],[8,24,8,26],[8,27,8,29],[8,30,8,32],[8,33,9,33],[8,34,9,34],[9,3,9,4],[9,19,9,20],[10,3,10,4],[10,5,10,7],[10,19,10,20],[11,3,11,4],[11,5,11,7],[11,19,11,20],[12,3,12,4],[12,5,12,7],[12,19,12,20],[13,3,13,4],[13,5,13,7],[13,19,13,20],[14,3,14,4],[14,5,14,7],[14,19,14,20],[15,3,15,4],[15,5,15,7],[15,19,15,20],[16,3,16,4],[16,5,16,7],[16,19,16,20],[17,3,17,4],[17,5,17,7],[17,19,17,20],[18,3,18,4],[18,5,18,7],[18,19,18,20],[19,3,19,4],[19,5,19,7],[19,19,19,20],[20,3,20,4],[20,5,20,7],[20,19,20,20],[21,3,21,4],[21,5,21,7],[21,19,21,20],[22,3,22,4],[22,5,22,7],[22,19,22,20],[23,3,23,4],[23,5,23,7],[23,19,23,20],[24,3,24,4],[24,5,24,7],[24,19,24,20],[25,3,25,4],[25,5,25,7],[25,19,25,20],[26,3,26,4],[26,5,26,7],[26,19,26,20],[27,3,27,4],[27,5,27,7],[27,19,27,20],[28,3,28,4],[28,5,28,7],[28,19,28,20],[29,3,29,4],[29,5,29,7],[29,19,29,20],[31,8,31,13],[32,8,32,13],[33,17,61,17],[36,1,37,1],[36,2,36,3],[36,4,36,6],[36,7,37,7],[36,8,37,10],[36,11,37,13],[36,14,36,15],[36,19,36,21],[36,22,36,23],[36,24,36,26],[36,27,36,29],[36,30,36,31],[36,32,36,33],[37,5,37,6],[37,19,37,20],[38,5,38,6],[38,8,38,10],[38,11,38,13],[38,19,38,20],[39,5,39,6],[39,8,39,10],[39,11,39,13],[39,19,39,20],[40,5,40,6],[40,8,40,10],[40,11,40,13],[40,19,40,20],[41,5,41,6],[41,8,41,10],[41,11,41,13],[41,19,41,20],[42,5,42,6],[42,8,42,10],[42,11,42,13],[42,19,42,20],[43,5,43,6],[43,8,43,10],[43,11,43,13],[43,19,43,20],[44,5,44,6],[44,8,44,10],[44,11,44,13],[44,19,44,20],[45,5,45,6],[45,8,45,10],[45,11,45,13],[45,19,45,20],[46,5,46,6],[46,8,46,10],[46,11,46,13],[46,19,46,20],[47,5,47,6],[47,8,47,10],[47,11,47,13],[47,19,47,20],[48,5,48,6],[48,8,48,10],[48,11,48,13],[48,19,48,20],[49,5,49,6],[49,8,49,10],[49,11,49,13],[49,19,49,20],[50,5,50,6],[50,8,50,10],[50,11,50,13],[50,19,50,20],[51,5,51,6],[51,8,51,10],[51,11,51,13],[51,19,51,20],[52,5,52,6],[52,8,52,10],[52,11,52,13],[52,19,52,20],[53,5,53,6],[53,8,53,10],[53,11,53,13],[53,19,53,20],[54,5,54,6],[54,8,54,10],[54,11,54,13],[54,19,54,20],[55,5,55,6],[55,8,55,10],[55,11,55,13],[55,19,55,20],[56,5,56,6],[56,8,56,10],[56,11,56,13],[56,19,56,20],[57,5,57,6],[57,8,57,10],[57,11,57,13],[57,19,57,20],[58,8,58,10],[58,11,58,13],[59,8,59,13],[62,0,64,0],[62,17,87,17],[63,1,64,1],[63,2,63,3],[63,4,63,6],[63,7,64,7],[63,8,64,8],[63,9,64,10],[63,11,64,11],[63,12,64,13],[63,14,63,15],[63,19,63,29],[63,30,64,30],[63,31,63,41],[63,42,64,42],[63,43,63,49],[64,5,64,6],[65,5,65,6],[65,9,65,10],[65,12,65,13],[66,5,66,6],[66,9,66,10],[66,12,66,13],[67,5,67,6],[67,9,67,10],[67,12,67,13],[68,5,68,6],[68,9,68,10],[68,12,68,13],[69,5,69,6],[69,9,69,10],[69,12,69,13],[70,5,70,6],[70,9,70,10],[70,12,70,13],[71,5,71,6],[71,9,71,10],[71,12,71,13],[72,5,72,6],[72,9,72,10],[72,12,72,13],[73,5,73,6],[73,9,73,10],[73,12,73,13],[74,5,74,6],[74,9,74,10],[74,12,74,13],[75,5,75,6],[75,9,75,10],[75,12,75,13],[76,5,76,6],[76,9,76,10],[76,12,76,13],[77,5,77,6],[77,9,77,10],[77,12,77,13],[78,5,78,6],[78,9,78,10],[78,12,78,13],[79,5,79,6],[79,9,79,10],[79,12,79,13],[80,5,80,6],[80,9,80,10],[80,12,80,13],[81,5,81,6],[81,9,81,10],[81,12,81,13],[82,5,82,6],[82,9,82,10],[82,12,82,13],[83,5,83,6],[83,9,83,10],[83,12,83,13],[84,5,84,6],[84,9,84,10],[84,12,84,13],[85,12,85,13],[88,17,96,17],[90,0,92,16],[96,1,96,3],[96,4,96,8],[97,17,99,17],[100,17,126,17],[102,1,112,1],[102,2,107,2],[102,7,107,7],[108,2,111,2],[108,7,111,7],[114,1,114,4],[115,1,115,4],[116,1,116,4]]}
[{"$nulls":14},"Retained Units",{"$f":"IFERROR(SUM(AE11:AE30), \"Error ▲\")","v":{"v":0,"d":"0.0000"}},null,"Data beyond this column is automated"]
[null,"Site Name",{"$f":"IF('2. Site Details'!D4=\"\",\"Enter site name on 2. Site Details\",'2. Site Details'!D4)","v":" 'Glenside' 45 Windmill Lane, Alton, Hampshire GU34 2SN"},null,null,"Instructions:\n\n1. Enter data into 1a. Baseline habitats \n2. Enter data on habitats to be created into 1b. Habitats to be created\n3. Enter data on habitats to be enhanced into 1c. Habitats to be enhanced\n",{"$nulls":3},{"$f":"IFERROR(IF(OR((ISNUMBER(SEARCH(\"▲\",A7:Q101)))),\"Input Errors Present On Sheet - Red Cells Or ▲ Highlight Errors\",\"All Key Rules Satisfied ✓ \"),\"Technical Errors On Sheet ▲\")","v":"All Key Rules Satisfied ✓ "},{"$nulls":4},"Lost Units",{"$f":"IFERROR(N31, \"Error ▲\")","v":{"v":0,"d":"0.0000"}}]
[null,"Sheet Name","6. Hedges & Lines of Trees",{"$nulls":11},"Created Units",{"$f":"IFERROR(L59, \"Error ▲\")","v":{"v":0.05086538813460001,"d":"0.0509"}}]
[{"$nulls":14},"Enhancement Units",{"$f":"IFERROR(L86, \"Error ▲\")","v":{"v":0,"d":"0.0000"}}]
[{"$nulls":14},"Net Change",{"$f":"IFERROR(P1+L59+L86-L31, \"Error ▲\")","v":{"v":0.05086538813460001,"d":"0.0509"}}]
[]
{"$rows_left_out":112}
{"sheet":"7. Watercourses","index":6,"n_rows":109,"n_cols":76,"rows_kept":109,"merged":[[0,17,30,17],[1,2,1,3],[1,5,5,7],[1,9,4,12],[2,2,2,3],[8,1,9,1],[8,2,8,4],[8,5,9,7],[8,8,8,10],[8,11,8,13],[8,14,8,15],[8,19,8,21],[8,22,8,23],[8,24,8,26],[8,27,8,29],[8,30,8,32],[8,33,9,33],[8,34,9,34],[8,35,9,35],[9,3,9,4],[9,19,9,20],[10,3,10,4],[10,5,10,7],[10,19,10,20],[11,3,11,4],[11,5,11,7],[11,19,11,20],[12,3,12,4],[12,5,12,7],[12,19,12,20],[13,3,13,4],[13,5,13,7],[13,19,13,20],[14,3,14,4],[14,5,14,7],[14,19,14,20],[15,3,15,4],[15,5,15,7],[15,19,15,20],[16,3,16,4],[16,5,16,7],[16,19,16,20],[17,3,17,4],[17,5,17,7],[17,19,17,20],[18,3,18,4],[18,5,18,7],[18,19,18,20],[19,3,19,4],[19,5,19,7],[19,19,19,20],[20,3,20,4],[20,5,20,7],[20,19,20,20],[21,3,21,4],[21,5,21,7],[21,19,21,20],[22,3,22,4],[22,5,22,7],[22,19,22,20],[23,3,23,4],[23,5,23,7],[23,19,23,20],[24,3,24,4],[24,5,24,7],[24,19,24,20],[25,3,25,4],[25,5,25,7],[25,19,25,20],[26,3,26,4],[26,5,26,7],[26,19,26,20],[27,3,27,4],[27,5,27,7],[27,19,27,20],[28,3,28,4],[28,5,28,7],[28,19,28,20],[29,3,29,4],[29,5,29,7],[29,19,29,20],[31,8,31,13],[32,8,32,13],[33,17,61,17],[36,1,37,1],[36,2,36,3],[36,4,36,6],[36,7,37,7],[36,8,37,10],[36,11,37,13],[36,14,36,15],[36,19,36,21],[36,22,36,23],[36,24,36,26],[36,27,36,29],[36,30,36,31],[36,32,36,33],[36,34,37,34],[37,5,37,6],[37,19,37,20],[38,5,38,6],[38,8,38,10],[38,11,38,13],[38,19,38,20],[39,5,39,6],[39,8,39,10],[39,11,39,13],[39,19,39,20],[40,5,40,6],[40,8,40,10],[40,11,40,13],[40,19,40,20],[41,5,41,6],[41,8,41,10],[41,11,41,13],[41,19,41,20],[42,5,42,6],[42,8,42,10],[42,11,42,13],[42,19,42,20],[43,5,43,6],[43,8,43,10],[43,11,43,13],[43,19,43,20],[44,5,44,6],[44,8,44,10],[44,11,44,13],[44,19,44,20],[45,5,45,6],[45,8,45,10],[45,11,45,13],[45,19,45,20],[46,5,46,6],[46,8,46,10],[46,11,46,13],[46,19,46,20],[47,5,47,6],[47,8,47,10],[47,11,47,13],[47,19,47,20],[48,5,48,6],[48,8,48,10],[48,11,48,13],[48,19,48,20],[49,5,49,6],[49,8,49,10],[49,11,49,13],[49,19,49,20],[50,5,50,6],[50,8,50,10],[50,11,50,13],[50,19,50,20],[51,5,51,6],[51,8,51,10],[51,11,51,13],[51,19,51,20],[52,5,52,6],[52,8,52,10],[52,11,52,13],[52,19,52,20],[53,5,53,6],[53,8,53,10],[53,11,53,13],[53,19,53,20],[54,5,54,6],[54,8,54,10],[54,11,54,13],[54,19,54,20],[55,5,55,6],[55,8,55,10],[55,11,55,13],[55,19,55,20],[56,5,56,6],[56,8,56,10],[56,11,56,13],[56,19,56,20],[57,5,57,6],[57,8,57,10],[57,11,57,13],[57,19,57,20],[58,8,58,10],[58,11,58,13],[62,0,64,0],[62,17,87,17],[62,52,63,52],[63,1,64,1],[63,2,63,3],[63,4,63,6],[63,7,64,7],[63,8,64,8],[63,9,64,10],[63,11,64,11],[63,12,64,13],[63,14,63,15],[63,19,63,29],[63,30,64,30],[63,31,63,41],[63,42,64,42],[63,43,63,47],[64,5,64,6],[65,5,65,6],[65,9,65,10],[65,12,65,13],[66,5,66,6],[66,9,66,10],[66,12,66,13],[67,5,67,6],[67,9,67,10],[67,12,67,13],[68,5,68,6],[68,9,68,10],[68,12,68,13],[69,5,69,6],[69,9,69,10],[69,12,69,13],[70,5,70,6],[70,9,70,10],[70,12,70,13],[71,5,71,6],[71,9,71,10],[71,12,71,13],[72,5,72,6],[72,9,72,10],[72,12,72,13],[73,5,73,6],[73,9,73,10],[73,12,73,13],[74,5,74,6],[74,9,74,10],[74,12,74,13],[75,5,75,6],[75,9,75,10],[75,12,75,13],[76,5,76,6],[76,9,76,10],[76,12,76,13],[77,5,77,6],[77,9,77,10],[77,12,77,13],[78,5,78,6],[78,9,78,10],[78,12,78,13],[79,5,79,6],[79,9,79,10],[79,12,79,13],[80,5,80,6],[80,9,80,10],[80,12,80,13],[81,5,81,6],[81,9,81,10],[81,12,81,13],[82,5,82,6],[82,9,82,10],[82,12,82,13],[83,5,83,6],[83,9,83,10],[83,12,83,13],[84,5,84,6],[84,9,84,10],[84,12,84,13],[85,12,85,13],[88,17,96,17],[90,0,92,16],[96,2,96,3],[96,4,96,8],[97,17,99,17],[100,17,129,17],[102,2,105,2],[102,3,104,3],[102,8,104,8],[107,2,107,5],[108,2,108,5]]}
[{"$nulls":14},"Retained Units",{"$f":"IFERROR(SUM(AE11:AE30), \"Error ▲\")","v":{"v":0,"d":"0.0000"}},null,"Data beyond this column is automated"]
[null,"Site Name",{"$f":"IF('2. Site Details'!D4=\"\",\"Enter site name on 2. Site Details\",'2. Site Details'!D4)","v":" 'Glenside' 45 Windmill Lane, Alton, Hampshire GU34 2SN"},null,null,"Instructions:\n\n1. Enter data into 1a. Baseline habitats\n2. Enter data on habitats to be created into 1b. Habitats to be created\n3. Enter data on Habitats to be enhanced into 1c. Habitats to be enhanced\n",{"$nulls":3},{"$f":"IFERROR(IF(OR((ISNUMBER(SEARCH(\"▲\",A7:Q101)))),\"Input Errors Present On Sheet - Red Cells Or ▲ Highlight Errors\",\"All Key Rules Satisfied ✓ \"),\"Technical Errors On Sheet ▲\")","v":"All Key Rules Satisfied ✓ "},{"$nulls":4},"Lost Units",{"$f":"IFERROR(N31, \"Error ▲\")","v":{"v":0,"d":"0.0000"}}]
[null,"Sheet Name","7. Watercourses",{"$nulls":11},"Created Units",{"$f":"IFERROR(L59, \"Error ▲\")","v":{"v":0,"d":"0.0000"}}]
[{"$nulls":14},"Enhancement Units",{"$f":"IFERROR(L86, \"Error ▲\")","v":{"v":0,"d":"0.0000"}}]
[{"$nulls":14},"Net Change",{"$f":"IFERROR(P1+L59+L86-L31, \"Error ▲\")","v":{"v":0,"d":"0.0000"}}]
[]
{"$rows_left_out":104}
{"sheet":"8. Headline Results","index":7,"n_rows":65,"n_cols":6,"rows_kept":65,"merged":[[1,1,1,2],[1,3,1,4],[2,1,2,2],[2,3,2,4],[2,7,2,14],[4,1,4,2],[4,3,4,4],[6,1,6,2],[6,3,6,4],[8,1,8,2],[8,3,8,4],[9,3,9,4],[10,1,12,1],[14,1,16,1],[18,1,20,1],[22,1,24,1],[26,1,26,2],[26,3,26,4],[27,1,27,2],[27,3,27,4],[28,1,28,2],[28,3,28,4],[64,1,65,1],[66,1,67,1]]}
[]
[null,"Site Name",null,{"$f":"IF('2. Site Details'!D4=\"\",\"Enter site name on 2. Site Details\",'2. Site Details'!D4)","v":" 'Glenside' 45 Windmill Lane, Alton, Hampshire GU34 2SN"}]
[null,"Sheet Name",null,"Headline Results"]
[null,"Headline Results"]
[null,"Headline",null,{"$f":"IF(OR(D27>0,D28>0,D29>0),\"BNG Targets Not Met ▲\",\"BNG Targets Met ✓\")","v":"BNG Targets Not Met ▲"}]
[]
{"$rows_left_out":35}
{"sheet":"9. All Habitats + Multipliers","index":8,"n_rows":102,"n_cols":11,"rows_kept":102,"merged":[[0,1,0,9],[1,1,2,1],[1,2,1,5],[1,6,1,7],[1,8,1,9]]}
[null,"9. All Habitats + Multipliers - (general technical information for reference purposes only)",{"$nulls":8},9]
[null,"Ref","Habitat Type",{"$nulls":3},"Distinctiveness",null,"Risk Multipliers",null,"Location Multipliers"]
[null,null,"Habitat Type","Broad Habitat Group","Nearest Ukhab Habitat","Definitive Ukhab /  Unis Code","Distinctiveness Category ","Trading Notes","Technical Difficulty Creation","Technical Difficulty Enhancement","Connectivity"]
[null,1,"Arable field margins cultivated annually","Cropland",null,null,"Medium","Same broad habitat or a higher distinctiveness habitat required","Low","Low","Low"]
[null,2,"Arable field margins game bird mix","Cropland",null,null,"Medium","Same broad habitat or a higher distinctiveness habitat required","Low","Low","Low"]
[null,3,"Arable field margins pollen and nectar","Cropland",null,null,"Medium","Same broad habitat or a higher distinctiveness habitat required","Low","Low","Low"]
{"$rows_left_out":97}
{"sheet":"10. Condition and Temporal","index":9,"n_rows":85,"n_cols":14,"rows_kept":85,"merged":[[0,1,1,13],[2,1,4,1],[2,2,2,5],[2,6,2,12],[2,13,4,13],[3,2,4,2],[3,3,4,3],[3,4,4,4],[3,5,4,5],[3,11,4,11],[3,12,4,12]]}
[null,"10. Condition and Temporal - general technical information for refence purposes only)"]
[]
[null,"Habitat Type","Condition",{"$nulls":3},"Temporal Multipliers",{"$nulls":6},"Enhancement Rules"]
[null,null,"Baseline Default Condition","Creation Condition Options","Enhancement Habitat options","EnhancementDefault Condition","Years To Target Condition Creation - Moderate","Years To Target Condition Creation - Good","Years To Target Condition Creation - Poor","Years To Target Condition Creation - Condition assessment N/A","Years To Target Condition Creation - N/A Other","Time To Target Condition Enhancement - Moderate to Good","Time To Target Distinctiveness Enhancement - Low to Default Condition"]
[{"$nulls":6},"Moderate","Good","Poor","Condition Assessment N/A","N/A - Other"]
[null,"Arable field margins cultivated annually","Condition Assessment N/A","Condition Assessment N/A","Enhancement not possible","Condition Assessment N/A","Not Possible","Not Possible","Not Possible",1,"Not Possible","Not Possible",1,"Enhancement not possible"]
{"$rows_left_out":80}
{"sheet":"11. Lists","index":10,"n_rows":412,"n_cols":29,"rows_kept":412,"merged":[[32,9,32,10],[33,1,33,3],[33,5,33,7],[33,12,33,13],[33,16,33,19],[44,1,44,3],[44,5,44,6],[44,8,44,10],[44,12,44,15],[44,18,44,20]]}
["Broadhabitattype",null,"Cropland",null,"Grassland",null,"Heathlandandshrub",null,"Intertidalhardstructures",null,"Intertidalsediment",null,"Lakes",null,"Sparselyvegetatedland",null,"Urban",null,"Woodlandandforest",null,"HedgerowsandLinesoftrees",null,"Lineoftrees",null,"Watercourses",null,"Coastalsaltmarsh",null,"Individualtrees"]
["Cropland",null,"Arable field margins cultivated annually",null,"Bracken",null,"Blackthorn scrub",null,"Artificial hard structures",null,"Littoral coarse sediment",null,"Ornamental lake or pond",null,"Ruderal/Ephemeral",null,"Allotments",null,"Other coniferous woodland",null,"Species-rich native hedgerow",null,"Line of trees",null,"Canals",null,"Artificial saltmarshes and saline reedbeds",null,"Urban/rural tree"]
["Grassland",null,"Arable field margins game bird mix",null,"Modified grassland",null,"Bramble scrub",null,"Artificial features of hard structures",null,"Artificial littoral coarse sediment",null,"Ponds (non-priority habitat)",null,"Other inland rock and scree",null,"Artificial unvegetated, unsealed surface",null,"Other Scot's pine woodland",null,"Native hedgerow - associated with bank or ditch",null,"Ecologically valuable line of trees",null,"Culvert"]
["Heathland and shrub",null,"Arable field margins pollen and nectar",null,"Other lowland acid grassland",null,"Gorse scrub",null,"Artificial hard structures with integrated greening of grey infrastructure (IGGI)",null,"Artificial littoral mud",null,"Reservoirs",null,"Tall forbs",null,"Bioswale",null,"Other woodland; broadleaved",null,"Native hedgerow with trees",null,"Line of trees - associated with bank or ditch",null,"Ditches"]
["Intertidal hard structures",null,"Arable field margins tussocky",null,"Other neutral grassland",null,"Hawthorn scrub",{"$nulls":3},"Artificial littoral sand",{"$nulls":5},"Biodiverse green roof",null,"Other woodland; mixed",null,"Native hedgerow",null,"Ecologically valuable line of trees - associated with bank or ditch"]
["Intertidal sediment",null,"Cereal crops",null,"Upland acid grassland",null,"Hazel scrub",{"$nulls":3},"Artificial littoral muddy sand",{"$nulls":5},"Built linear features",{"$nulls":3},"Non-native and ornamental hedgerow"]
{"$rows_left_out":407}
{"sheet":"12. Version history","index":11,"n_rows":10,"n_cols":5,"rows_kept":10,"merged":[[2,2,2,4]]}
[]
[]
[null,null,"Small sites metric version history"]
[null,null,"Version","Changes made","Date released"]
[null,null,"Version 1.0.0","Initial statutory version","29th November 2023"]
[null,null,"Version 1.0.1","Updated to correct some labelling errors, minor forumla errors and expand column widths","12th February 2024"]
{"$rows_left_out":5}
{"sheet":"13. Habitats Translation","index":12,"n_rows":83,"n_cols":6,"rows_kept":83,"hidden":true,"merged":[[3,1,13,1],[3,2,6,2],[7,2,11,2],[14,1,18,1],[16,2,18,2],[19,1,26,1],[20,2,26,2],[27,1,37,1],[27,2,29,2],[30,2,32,2],[34,2,37,2],[38,1,40,1],[41,1,50,1],[51,1,52,1],[53,1,55,1],[56,1,57,1],[58,1,78,1],[63,2,64,2],[67,2,68,2],[76,2,77,2],[79,1,82,1],[79,2,80,2]]}
[]
[null,"BNG Group","Landsacpe Term","Unique Landscape Term (inc. BNG Code)","BNG Habitat","Distinctiveness"]
[null,"Coastal saltmarsh ","Saltmarsh","Saltmarsh - A2.5","Saltmarshes and saline reedbeds","Medium"]
[null,"Cropland","Cropland","Arable - c1c","Cereal crops","Low"]
[{"$nulls":3},"Arable - c1c7","Cereal crops other","Low"]
[{"$nulls":3},"Arable - c1d","Non-cereal crops","Low"]
{"$rows_left_out":77}