{"text_format":"3","workbook":"xlsx","n_sheets":13,"sheets":["1. Introduction","2. Site Details","3. Desktop Assessment","4. Supporting Information","5. Area Habitats","6. Hedges & Lines of Trees","7. Watercourses","8. Headline Results","9. All Habitats + Multipliers","10. Condition and Temporal","11. Lists","12. Version history","13. Habitats Translation"],"not_rendered":{"charts":1,"images":8,"macros":1,"external_links":1,"defined_names":53},"read":"whole","date_system":"1900"}

{"sheet":"1. Introduction","index":0,"n_rows":29,"n_cols":10,"rows_kept":29,"merged":[[0,3,4,9],[5,1,7,9],[8,1,9,9],[10,1,10,4],[10,5,10,9],[11,1,11,9],[13,1,14,1],[13,2,14,9],[16,1,16,7],[18,1,19,2],[18,3,19,7],[20,1,21,2],[20,3,21,7],[22,1,23,2],[22,3,23,7],[24,3,24,7],[25,3,25,7],[26,1,26,2],[26,3,26,7],[27,1,27,2],[27,3,27,7],[27,9,27,17],[28,1,28,2],[28,3,28,7]]}
[]
[]
[]
[]
[]
["created by Sam Arthur @ FPCR","Small Sites Metric \n(The Statutory Biodiversity Metric) \n"]
[]
[]
[]
[]
[null,"Version 1.2.3 Release Date:",{"$nulls":3},"3rd July 2025"]
[]
[]
[]
[]
[]
[null,"Cell style conventions"]
[]
[{"$nulls":3},"Enter data"]
[]
[{"$nulls":3},"Automated equation"]
[]
[{"$nulls":3},"Result"]
[]
[{"$nulls":3},"Title cell"]
[{"$nulls":3},"Title cell alt colour"]
[null,"▲",null,"Error"]
[null,"⚠",null,"Attention required",{"$nulls":5},"Technical Requirements - Excel Versions: 2010, 2013, 2016, 2019, Office 365, Excel for Android"]
[{"$nulls":3},"Use of this cell is not required "]

{"sheet":"2. Site Details","index":1,"n_rows":23,"n_cols":5,"rows_kept":23,"merged":[[1,1,1,2],[2,1,2,2],[3,1,3,2],[4,1,4,2],[5,1,5,2],[6,1,6,2],[7,1,7,2],[8,1,8,2],[9,1,9,2],[10,1,10,2],[12,1,14,1],[12,4,12,8],[13,4,13,8],[14,4,14,8],[16,1,18,1],[16,4,16,8],[17,4,17,8],[18,4,18,8],[20,1,20,3],[21,1,21,2],[22,1,22,2]]}
[]
[null,"Sheet Name",null,"Site Details"]
[null,"1. Planning authority:",null,"East Hampshire District Council"]
[null,"2. Site name:",null," 'Glenside' 45 Windmill Lane, Alton, Hampshire GU34 2SN"]
[null,"3. Applicant:",null,"Mrs D. Schreiner, Joyce Shearman, Patricia Lee"]
[null,"4. Planning application type:",null,"Full planning consent"]
[null,"5. Planning application reference:",null,"TBC"]
[null,"6. Metric completed by (name & job title):",null,"James Voller MCIAT"]
[null,"7. Date of metric completion:",null,"2024-08-26"]
[null,"8. Revision number:",null,"A"]
[null,"9. Masterplan document title / drawing number:",null,"2501-PL-02 Proposed Block / Site Plan"]
[null,"Net Gain Targets"]
[null,"10. Targeted % increase in Units","10a. Area habitats",{"v":10,"d":"10.00"},{"$f":"IF(D13<10,\"Caution - % target reduced below default ▲\",IF(D13>10,\"Caution -Target increased above default ⚠\",\"\"))","v":""}]
[null,null,"10b. Hedgerows",{"v":10,"d":"10.00"},{"$f":"IF(D14<10,\"Caution - % target reduced below default ▲\",IF(D14>10,\"Caution -Target increased above default ⚠\",\"\"))","v":""}]
[null,null,"10c. Watercourses",{"v":10,"d":"10.00"},""]
[]
[null,"11. Optional target increase in units if baseline value is zero ","11a. Area habitat units",{"v":0,"d":"0.00"},{"$f":"IF(D17=0,\"\",\"Unit increase Targets must be agreed with LPA ⚠\")","v":""}]
[null,null,"11b. Hedgerow units",{"v":0,"d":"0.00"},{"$f":"IF(D18=0,\"\",\"Unit increase Targets must be agreed with LPA ⚠\")","v":""}]
[null,null,"11c. Watercourse units",{"v":0,"d":"0.00"},""]
[]
[null,"For planning authority use only"]
[null,"12. Planning authority reviewer:"]
[null,"13. Date of planning authority review:"]

{"sheet":"3. Desktop Assessment","index":2,"n_rows":23,"n_cols":5,"rows_kept":23,"merged":[[1,2,1,3],[2,2,2,3],[5,4,5,7],[12,2,12,3],[13,2,13,3]]}
[]
[null,"Site Name:",{"$f":"IF('2. Site Details'!D4=\"\",\"Enter site name on 2. Site Details\",'2. Site Details'!D4)","v":" 'Glenside' 45 Windmill Lane, Alton, Hampshire GU34 2SN"}]
[null,"Sheet Name","Desktop Assessment"]
[]
[null,"Development"]
[null,"14. Select the type of proposed development.\nIf Other provide details at Q.25 below","Residential",{"$f":"IF(AND(C6=\"Residential\",C9=\"Unknown number\"),\"Site area must be less than 5,000 m2\",IF(C6=\"\",\"\",\"Site area must be less than 10,000 m2\"))","v":"Site area must be less than 10,000 m2"},{"$f":"IF(AND(C9=\"Unknown number\", C6=\"Residential\"),\"Site area limited by unknown number of dwellings ⚠\", \"\")","v":""}]
[null,"15. Site area (m2)",270,{"$f":"IF(AND(D6=\"Site area must be less than 10,000 m2\",C7>=10000),\"ERROR- Site too large for metric  - USE MAIN METRIC ▲\",IF(AND(D6=\"Site area must be less than 5,000 m2\",C7>=5000),\"ERROR- Site too large for metric  - USE MAIN METRIC ▲\",\"\"))","v":""}]
[null,{"$f":"IF(OR(C6=\"Residential\",C6=\"Other\"),\"N/A\",IF(C6=\"\",\"\",\"16. Building footprint (m2) of commercial buildings proposed within the development site (or zero if none)\"))","v":"N/A"},null,{"$f":"IF(AND(B8=\"n/a\",C8<>\"\"),\"ERROR- Not required\",IF(AND(C8<>\"\",C8>=1000),\"ERROR- Footprint too large for metric  - USE MAIN METRIC\",IF(AND(C8<>\"\",C8>C7),\"ERROR - Footprint larger than development area\",\"\")))","v":""}]
[null,{"$f":"IF(OR(C6=\"Commercial\",C6=\"Other\"),\"N/A\",IF(C6=\"\",\"\",\"17. Number of dwellings proposed within the development site\"))","v":"17. Number of dwellings proposed within the development site"},"Between 1 - 9 dwellings",{"$f":"IF(AND(B9=\"n/a\",C9<>\"\"),\"ERROR- Not required ▲\",IF(OR(AND(C6=\"Residential\",C9=\"Over 9 dwellings\"),AND(C6=\"Mixed\",C9=\"Over 9 dwellings\")),\"ERROR- Number of dwellings too large for metric  - USE MAIN METRIC ▲\",IF(AND(B9=\"17. Number of dwellings proposed within the development site\",C9=\"\"),\"ERROR - You must specify number of dwellings ▲\",\"\")))","v":""}]
[null,"Designated sites and priority habitats "]
[null,"18. Any designated sites on or within 500m of the site?","No",{"$f":"IF(C11=\"On site\",\"ERROR- Site too complex for metric - USE MAIN METRIC ▲\",IF(C11=\"Within 500m of site boundary\",\"Consider using main metric tool ⚠\",\"\"))","v":""}]
[null,"19. Any priority habitats on or within 500m of the site?","Within 500m of site boundary",{"$f":"IF(C12=\"On site\",\"ERROR- Site too complex for metric - USE MAIN METRIC ▲\",IF(C12=\"Within 500m of site boundary\",\"Consider using main metric tool ⚠\",\"\"))","v":"Consider using main metric tool ⚠"}]
[null,"20. List the designated sites and/or priority habitats","Priority Habitat Inventory - Decidious Woodland / Traditional Orchards"]
[null,"21. Information sources used for assessment of designated sites and priority habitats\n(See guidance)","MAGiC interasctive mapping"]
[null,"European protected species"]
[null,"22. Any european protected species present on site","No",{"$f":"IF(C16=\"Yes\",\"ERROR- Site too complex for metric - USE MAIN METRIC ▲\",\"\")","v":""}]
[]
[null,"Site walkover"]
[null,"23. Site walkover completed?","Walkover completed by competent person",{"$f":"IF(C19=\"Walkover completed by competent person\",\"A competent person should be able to confidently identify the habitats onsite\",IF(C19=\"No Walkover Undertaken\",\"ERROR- Site walkover required\",\"\"))","v":"A competent person should be able to confidently identify the habitats onsite"}]
[null,"24. Date of site walkover - DD/MM/YY","2025-08-26",{"$f":"IF(C20=\"\",\"Walkover date required ▲\",\"Site walkover data valid until \"&TEXT(EDATE(C20,6),\"dd/mm/yy\"))","v":"Site walkover data valid until 26/02/26"}]
[null,"25. Who completed the walkover? \n(Name and job title)","James Voller"]
[null,"Additional details"]
[null,"26. Any additional information or notes","Site is retained and maintained  garden land"]

{"sheet":"4. Supporting Information","index":3,"n_rows":47,"n_cols":5,"rows_kept":47,"merged":[[1,1,1,2],[1,4,2,4],[2,1,2,2],[4,3,4,4],[7,1,8,1],[9,1,10,1],[11,1,12,1],[13,1,14,1],[15,1,16,1],[17,1,18,1],[19,1,20,1],[21,1,22,1],[23,1,24,1],[25,1,26,1],[27,1,28,1],[29,1,30,1],[31,1,32,1],[33,1,34,1],[35,1,36,1],[37,1,38,1],[39,1,40,1],[41,1,42,1],[43,1,44,1],[45,1,46,1]]}
[]
[null,"Site Name:",null,{"$f":"IF('2. Site Details'!D4=\"\",\"Enter site name on 2. Site Details\",'2. Site Details'!D4)","v":" 'Glenside' 45 Windmill Lane, Alton, Hampshire GU34 2SN"},{"$f":"IF(OR('3. Desktop Assessment'!C19=\"Walkover completed by competent person\",'3. Desktop Assessment'!C19=\"No walkover undertaken\"),IF(COUNTA(D8:E8,D10:E10,D14:E14,D16:E16,D18:E18,D22:E22,D26:E26,D30:E30,D34:E34,D38:E38,D42:E42,D46:E46,D12:E12,D20:E20,D24:E24,D28:E28,D32:E32,D36:E36,D40:E40,D44:E44)=0,\"Error - Site photographs required to support application\",\"\"),\"\")","v":""}]
[null,"Sheet Name",null,"Supporting Information"]
[]
[null,"Baseline Habitat Photos",null,"Insert photographs to support assumptions made in the metric"]
[]
[null,"Ref","Habitat type","Photo 1","Photo 2"]
[null,1,"Date taken","2025-08-26","2025-08-26"]
[null,null,{"$f":"IF('5. Area Habitats'!D11=0,\"\",'5. Area Habitats'!D11)","v":"Vegetated garden"}]
[null,2,"Date taken","2025-08-26","2025-08-26"]
[null,null,{"$f":"IF('5. Area Habitats'!D12=0,\"\",'5. Area Habitats'!D12)","v":"Unvegetated garden"}]
[null,3,"Date taken","2025-08-26","2025-08-26"]
[null,null,{"$f":"IF('5. Area Habitats'!D13=0,\"\",'5. Area Habitats'!D13)","v":""}]
[null,4,"Date taken","2025-08-26","2025-08-26"]
[null,null,{"$f":"IF('5. Area Habitats'!D14=0,\"\",'5. Area Habitats'!D14)","v":""}]
[null,5,"Date taken"]
[null,null,{"$f":"IF('5. Area Habitats'!D15=0,\"\",'5. Area Habitats'!D15)","v":""}]
[null,6,"Date taken"]
[null,null,{"$f":"IF('5. Area Habitats'!D16=0,\"\",'5. Area Habitats'!D16)","v":""}]
[null,7,"Date taken"]
[null,null,{"$f":"IF('5. Area Habitats'!D17=0,\"\",'5. Area Habitats'!D17)","v":""}]
[null,8,"Date taken"]
[null,null,{"$f":"IF('5. Area Habitats'!D18=0,\"\",'5. Area Habitats'!D18)","v":""}]
[null,9,"Date taken"]
[null,null,{"$f":"IF('5. Area Habitats'!D19=0,\"\",'5. Area Habitats'!D19)","v":""}]
[null,10,"Date taken"]
[null,null,{"$f":"IF('5. Area Habitats'!D20=0,\"\",'5. Area Habitats'!D20)","v":""}]
[null,11,"Date taken"]
[null,null,{"$f":"IF('5. Area Habitats'!D21=0,\"\",'5. Area Habitats'!D21)","v":""}]
[null,12,"Date taken"]
[null,null,{"$f":"IF('5. Area Habitats'!D22=0,\"\",'5. Area Habitats'!D22)","v":""}]
[null,13,"Date taken"]
[null,null,{"$f":"IF('5. Area Habitats'!D23=0,\"\",'5. Area Habitats'!D23)","v":""}]
[null,14,"Date taken"]
[null,null,{"$f":"IF('5. Area Habitats'!D24=0,\"\",'5. Area Habitats'!D24)","v":""}]
[null,15,"Date taken"]
[null,null,{"$f":"IF('5. Area Habitats'!D25=0,\"\",'5. Area Habitats'!D25)","v":""}]
[null,16,"Date taken"]
[null,null,{"$f":"IF('5. Area Habitats'!D26=0,\"\",'5. Area Habitats'!D26)","v":""}]
[null,17,"Date taken"]
[null,null,{"$f":"IF('5. Area Habitats'!D27=0,\"\",'5. Area Habitats'!D27)","v":""}]
[null,18,"Date taken"]
[null,null,{"$f":"IF('5. Area Habitats'!D28=0,\"\",'5. Area Habitats'!D28)","v":""}]
[null,19,"Date taken"]
[null,null,{"$f":"IF('5. Area Habitats'!D29=0,\"\",'5. Area Habitats'!D29)","v":""}]
[null,20,"Date taken"]
[null,null,{"$f":"IF('5. Area Habitats'!D30=0,\"\",'5. Area Habitats'!D30)","v":""}]

{"sheet":"5. Area Habitats","index":4,"n_rows":142,"n_cols":76,"rows_kept":142,"merged":[[0,17,31,17],[1,2,1,3],[1,5,5,7],[1,9,4,12],[2,2,2,3],[8,1,9,1],[8,2,8,4],[8,5,9,7],[8,8,8,10],[8,11,8,13],[8,14,8,15],[8,19,8,21],[8,22,8,23],[8,24,8,26],[8,27,8,29],[8,30,8,32],[8,33,9,33],[8,34,9,34],[9,3,9,4],[9,19,9,20],[10,3,10,4],[10,5,10,7],[10,19,10,20],[11,3,11,4],[11,5,11,7],[11,19,11,20],[12,3,12,4],[12,5,12,7],[12,19,12,20],[13,3,13,4],[13,5,13,7],[13,19,13,20],[14,3,14,4],[14,5,14,7],[14,19,14,20],[15,3,15,4],[15,5,15,7],[15,19,15,20],[16,3,16,4],[16,5,16,7],[16,19,16,20],[17,3,17,4],[17,5,17,7],[17,19,17,20],[18,3,18,4],[18,5,18,7],[18,19,18,20],[19,3,19,4],[19,5,19,7],[19,19,19,20],[20,3,20,4],[20,5,20,7],[20,19,20,20],[21,3,21,4],[21,5,21,7],[21,19,21,20],[22,3,22,4],[22,5,22,7],[22,19,22,20],[23,3,23,4],[23,5,23,7],[23,19,23,20],[24,3,24,4],[24,5,24,7],[24,19,24,20],[25,3,25,4],[25,5,25,7],[25,19,25,20],[26,3,26,4],[26,5,26,7],[26,19,26,20],[27,3,27,4],[27,5,27,7],[27,19,27,20],[28,3,28,4],[28,5,28,7],[28,19,28,20],[29,3,29,4],[29,5,29,7],[29,19,29,20],[30,3,30,4],[30,5,30,7],[30,19,30,20],[32,8,32,13],[33,8,33,13],[34,8,34,13],[34,17,63,17],[37,1,38,1],[37,2,37,3],[37,4,37,6],[37,7,38,7],[37,8,38,10],[37,11,38,13],[37,14,37,15],[37,19,37,21],[37,22,37,23],[37,24,37,26],[37,27,37,29],[37,30,37,31],[37,32,37,33],[38,5,38,6],[38,19,38,20],[39,5,39,6],[39,8,39,10],[39,11,39,13],[39,19,39,20],[40,5,40,6],[40,8,40,10],[40,11,40,13],[40,19,40,20],[41,5,41,6],[41,8,41,10],[41,11,41,13],[41,19,41,20],[42,5,42,6],[42,8,42,10],[42,11,42,13],[42,19,42,20],[43,5,43,6],[43,8,43,10],[43,11,43,13],[43,19,43,20],[44,5,44,6],[44,8,44,10],[44,11,44,13],[44,19,44,20],[45,5,45,6],[45,8,45,10],[45,11,45,13],[45,19,45,20],[46,5,46,6],[46,8,46,10],[46,11,46,13],[46,19,46,20],[47,5,47,6],[47,8,47,10],[47,11,47,13],[47,19,47,20],[48,5,48,6],[48,8,48,10],[48,11,48,13],[48,19,48,20],[49,5,49,6],[49,8,49,10],[49,11,49,13],[49,19,49,20],[50,5,50,6],[50,8,50,10],[50,11,50,13],[50,19,50,20],[51,5,51,6],[51,8,51,10],[51,11,51,13],[51,19,51,20],[52,5,52,6],[52,8,52,10],[52,11,52,13],[52,19,52,20],[53,5,53,6],[53,8,53,10],[53,11,53,13],[53,19,53,20],[54,5,54,6],[54,8,54,10],[54,11,54,13],[54,19,54,20],[55,5,55,6],[55,8,55,10],[55,11,55,13],[55,19,55,20],[56,5,56,6],[56,8,56,10],[56,11,56,13],[56,19,56,20],[57,5,57,6],[57,8,57,10],[57,11,57,13],[57,19,57,20],[58,5,58,6],[58,8,58,10],[58,11,58,13],[58,19,58,20],[59,5,59,6],[59,8,59,10],[59,11,59,13],[59,19,59,20],[60,8,60,10],[60,11,60,13],[61,8,61,13],[64,17,108,17],[65,1,66,1],[65,2,65,3],[65,4,65,6],[65,7,66,7],[65,8,66,8],[65,9,66,10],[65,11,66,11],[65,12,66,13],[65,14,65,15],[65,19,65,29],[65,30,66,30],[65,31,65,41],[65,42,66,42],[65,43,65,49],[66,5,66,6],[67,5,67,6],[67,9,67,10],[67,12,67,13],[68,5,68,6],[68,9,68,10],[68,12,68,13],[69,5,69,6],[69,9,69,10],[69,12,69,13],[70,5,70,6],[70,9,70,10],[70,12,70,13],[71,5,71,6],[71,9,71,10],[71,12,71,13],[72,5,72,6],[72,9,72,10],[72,12,72,13],[73,5,73,6],[73,9,73,10],[73,12,73,13],[74,5,74,6],[74,9,74,10],[74,12,74,13],[75,5,75,6],[75,9,75,10],[75,12,75,13],[76,5,76,6],[76,9,76,10],[76,12,76,13],[77,5,77,6],[77,9,77,10],[77,12,77,13],[78,5,78,6],[78,9,78,10],[78,12,78,13],[79,5,79,6],[79,9,79,10],[79,12,79,13],[80,5,80,6],[80,9,80,10],[80,12,80,13],[81,5,81,6],[81,9,81,10],[81,12,81,13],[82,5,82,6],[82,9,82,10],[82,12,82,13],[83,5,83,6],[83,9,83,10],[83,12,83,13],[84,5,84,6],[84,9,84,10],[84,12,84,13],[85,5,85,6],[85,9,85,10],[85,12,85,13],[86,5,86,6],[86,9,86,10],[86,12,86,13],[87,5,87,6],[87,9,87,10],[87,12,87,13],[88,12,88,13],[92,1,93,2],[92,3,93,3],[92,4,93,5],[92,6,93,7],[92,8,92,15],[93,8,93,10],[93,11,93,13],[93,14,93,15],[94,1,94,2],[94,4,94,5],[94,6,94,7],[94,8,94,10],[94,11,94,13],[94,14,94,15],[95,1,95,2],[95,4,95,5],[95,6,95,7],[95,8,95,10],[95,11,95,13],[95,14,95,15],[96,1,96,2],[96,4,96,5],[96,6,96,7],[96,8,96,10],[96,11,96,13],[96,14,96,15],[97,1,97,2],[97,4,97,5],[97,6,97,7],[97,8,97,10],[97,11,97,13],[97,14,97,15],[98,1,98,2],[98,4,98,5],[98,6,98,7],[98,8,98,10],[98,11,98,13],[98,14,98,15],[99,4,99,6],[101,0,103,16],[107,1,107,3],[107,4,107,8],[108,1,108,3],[108,4,108,8],[109,17,136,17],[112,1,112,3],[113,1,114,3],[115,1,116,3],[117,1,118,3],[119,1,120,3],[121,1,122,3],[123,1,124,3],[125,1,126,3],[127,1,128,3],[129,1,130,3],[131,1,132,3],[133,1,134,3],[136,1,136,4],[137,1,137,4],[137,17,168,17],[138,1,138,4],[139,1,139,4],[139,5,139,7]]}
[{"$nulls":14},"Retained Units",{"$f":"IFERROR(SUM(AE11:AE31), \"Error ▲\")","v":{"v":0.18719423999999998,"d":"0.1872"}},null,"Data beyond this column is automated"]
[null,"Site Name",{"$f":"IF('2. Site Details'!D4=\"\",\"Enter site name on 2. Site Details\",'2. Site Details'!D4)","v":" 'Glenside' 45 Windmill Lane, Alton, Hampshire GU34 2SN"},null,null,"Instructions:\n1. Enter data into 1a. Baseline habitats table \n2. Enter data on habitats to be created into 1b. Habitats to be created\n3. Enter data on habitats to be enhanced into 1c. Habitats to be enhanced \n4. Enter data on individual trees into 1d. Tree area calculator\n",{"$nulls":3},{"$f":"IFERROR(IF(OR((ISNUMBER(SEARCH(\"▲\",A7:Q101)))),\"Input Errors Present On Sheet - Red Cells Or ▲ Highlight Errors\",\"All Key Rules Satisfied ✓ \"),\"Technical Errors On Sheet ▲\")","v":"All Key Rules Satisfied ✓ "},{"$nulls":4},"Lost Units",{"$f":"IFERROR(N32, \"Error ▲\")","v":{"v":0.08643884800000001,"d":"0.0864"}}]
[null,"Sheet Name","5. Area Habitats",{"$nulls":11},"Created Units",{"$f":"IFERROR(L61, \"Error ▲\")","v":{"v":0.05469358497959577,"d":"0.0547"}}]
[{"$nulls":14},"Enhancement Units",{"$f":"IFERROR(L89, \"Error ▲\")","v":{"v":0,"d":"0.0000"}}]
[{"$nulls":14},"Net Change",{"$f":"IFERROR((P1+L61+L89)-L32, \"Error ▲\")","v":{"v":-0.0317452630204042,"d":"-0.0317"}}]
[]
[null,"1a. Baseline habitats"]
[]
[null,"Ref","Habitat",null,null,"C. Strategic significance",null,null,"Areas (m2)",null,null,"Baseline results",null,null,"Comments",{"$nulls":4},"Habitat distinctiveness",null,null,"Habitat condition",{"$nulls":4},"Strategic significance",null,null,"Ecological baseline",null,null,"Suggested action to address habitat losses","Enhancement rules"]
[null,null,"A. Broad Habitat"," B. Habitat type",{"$nulls":4},"D. Total Area ","E. Area retained","F. Area enhanced","Total habitat units onsite","Area Lost","Units lost","User comments","LPA comments",{"$nulls":3},"Distinctiveness",null,"Score","Condition ","Score",{"$nulls":3},"Strategic significance","Strategic significance","Strategic significance multiplier","Baseline units retained","Baseline units to be enhanced","Area lost"]
[null,1,"Urban","Vegetated garden",null,"Area/compensation not in local strategy/ no local strategy",null,null,{"v":245,"d":"245.00"},{"v":0,"d":"0.00"},{"v":0,"d":"0.00"},{"$f":"IF(C11=\"\",\"\",IFERROR(IF(I11=\"\",\"\",((I11/10000)*V11*X11)*AD11),\"Error ▲\"))","v":{"v":0.049,"d":"0.05"}},{"$f":"IF(I11=\"\",\"\",IF(J11+K11>I11,\"Area Error ▲\",I11-J11-K11))","v":{"v":245,"d":"245.00"}},{"$f":"IFERROR(IF(I11=\"\",\"\",IF(M11=\"Area Error ▲\",\"Area Error ▲\",((M11/10000)*V11*X11)*AD11)),\"This intervention is not permitted within the SSM ▲\")","v":0.049},"Grass garden",{"$nulls":4},{"$f":"IF(C11=\"\",\"\",VLOOKUP(D11,'9. All Habitats + Multipliers'!$C$4:$K$102,5,FALSE))","v":"Low"},null,{"$f":"IF(T11=\"\",\"\",VLOOKUP(T11,'11. Lists'!$B$47:$D$49,2,FALSE))","v":2},{"$f":"IF(C11=\"\",\"\",VLOOKUP(D11,'10. Condition and Temporal'!$B$6:$C$103,2,FALSE))","v":"Condition Assessment N/A"},{"$f":"IF(W11=\"\",\"\",VLOOKUP(W11,'11. Lists'!$F$47:$G$51,2,FALSE))","v":1},{"$nulls":3},{"$f":"IF(F11=\"\",\"\",F11)","v":"Area/compensation not in local strategy/ no local strategy"},{"$f":"IF(AB11=\"\",\"\",VLOOKUP(AB11,'11. Lists'!$F$36:$H$38,2,FALSE))","v":"Low Strategic Significance"},{"$f":"IF(AB11=\"\",\"\",VLOOKUP(AB11,'11. Lists'!$F$36:$H$38,3,FALSE))","v":1},{"$f":"IF(D11=\"\",\"\",((J11/10000)*V11*X11)*AD11)","v":{"v":0,"d":"0.0000"}},{"$f":"IF(D11=\"\",\"\",((K11/10000)*V11*X11)*AD11)","v":{"v":0,"d":"0.0000"}},{"$f":"IF(D11=\"\",\"\",M11)","v":{"v":245,"d":"245.00"}},{"$f":"IF(T11=\"\",\"\",VLOOKUP(T11,'11. Lists'!$B$47:$D$49,3,FALSE))","v":"Same distinctiveness or better habitat required"},{"$f":"IF(D11=\"\",\"\",VLOOKUP(D11,'10. Condition and Temporal'!$B$6:$L$103,4,FALSE))","v":"Enhancement not possible"}]
[null,2,"Urban","Unvegetated garden",null,"Area/compensation not in local strategy/ no local strategy",null,null,{"v":25,"d":"25.00"},{"v":0,"d":"0.00"},null,{"$f":"IF(C12=\"\",\"\",IFERROR(IF(I12=\"\",\"\",((I12/10000)*V12*X12)*AD12),\"Error ▲\"))","v":{"v":0,"d":"0.00"}},{"$f":"IF(I12=\"\",\"\",IF(J12+K12>I12,\"Area Error ▲\",I12-J12-K12))","v":{"v":25,"d":"25.00"}},{"$f":"IFERROR(IF(I12=\"\",\"\",IF(M12=\"Area Error ▲\",\"Area Error ▲\",((M12/10000)*V12*X12)*AD12)),\"This intervention is not permitted within the SSM ▲\")","v":{"v":0,"d":"0.000"}},"Flower beds",{"$nulls":4},{"$f":"IF(C12=\"\",\"\",VLOOKUP(D12,'9. All Habitats + Multipliers'!$C$4:$K$102,5,FALSE))","v":"V.Low"},null,{"$f":"IF(T12=\"\",\"\",VLOOKUP(T12,'11. Lists'!$B$47:$D$49,2,FALSE))","v":0},{"$f":"IF(C12=\"\",\"\",VLOOKUP(D12,'10. Condition and Temporal'!$B$6:$C$103,2,FALSE))","v":"N/A - Other"},{"$f":"IF(W12=\"\",\"\",VLOOKUP(W12,'11. Lists'!$F$47:$G$51,2,FALSE))","v":0},{"$nulls":3},{"$f":"IF(F12=\"\",\"\",F12)","v":"Area/compensation not in local strategy/ no local strategy"},{"$f":"IF(AB12=\"\",\"\",VLOOKUP(AB12,'11. Lists'!$F$36:$H$38,2,FALSE))","v":"Low Strategic Significance"},{"$f":"IF(AB12=\"\",\"\",VLOOKUP(AB12,'11. Lists'!$F$36:$H$38,3,FALSE))","v":1},{"$f":"IF(D12=\"\",\"\",((J12/10000)*V12*X12)*AD12)","v":{"v":0,"d":"0.0000"}},{"$f":"IF(D12=\"\",\"\",((K12/10000)*V12*X12)*AD12)","v":{"v":0,"d":"0.0000"}},{"$f":"IF(D12=\"\",\"\",M12)","v":{"v":25,"d":"25.00"}},{"$f":"IF(T12=\"\",\"\",VLOOKUP(T12,'11. Lists'!$B$47:$D$49,3,FALSE))","v":"Compensation Not Required"},{"$f":"IF(D12=\"\",\"\",VLOOKUP(D12,'10. Condition and Temporal'!$B$6:$L$103,4,FALSE))","v":"Enhancement not possible"}]
[null,3,{"$nulls":9},"","","",{"$nulls":5},{"$f":"IF(C13=\"\",\"\",VLOOKUP(D13,'9. All Habitats + Multipliers'!$C$4:$K$102,5,FALSE))","v":""},null,{"$f":"IF(T13=\"\",\"\",VLOOKUP(T13,'11. Lists'!$B$47:$D$49,2,FALSE))","v":""},{"$f":"IF(C13=\"\",\"\",VLOOKUP(D13,'10. Condition and Temporal'!$B$6:$C$103,2,FALSE))","v":""},{"$f":"IF(W13=\"\",\"\",VLOOKUP(W13,'11. Lists'!$F$47:$G$51,2,FALSE))","v":""},{"$nulls":3},{"$f":"IF(F13=\"\",\"\",F13)","v":""},{"$f":"IF(AB13=\"\",\"\",VLOOKUP(AB13,'11. Lists'!$F$36:$H$38,2,FALSE))","v":""},{"$f":"IF(AB13=\"\",\"\",VLOOKUP(AB13,'11. Lists'!$F$36:$H$38,3,FALSE))","v":""},"","","",{"$f":"IF(T13=\"\",\"\",VLOOKUP(T13,'11. Lists'!$B$47:$D$49,3,FALSE))","v":""},{"$f":"IF(D13=\"\",\"\",VLOOKUP(D13,'10. Condition and Temporal'!$B$6:$L$103,4,FALSE))","v":""}]
[null,4,{"$nulls":9},"","","",{"$nulls":5},{"$f":"IF(C14=\"\",\"\",VLOOKUP(D14,'9. All Habitats + Multipliers'!$C$4:$K$102,5,FALSE))","v":""},null,{"$f":"IF(T14=\"\",\"\",VLOOKUP(T14,'11. Lists'!$B$47:$D$49,2,FALSE))","v":""},{"$f":"IF(C14=\"\",\"\",VLOOKUP(D14,'10. Condition and Temporal'!$B$6:$C$103,2,FALSE))","v":""},{"$f":"IF(W14=\"\",\"\",VLOOKUP(W14,'11. Lists'!$F$47:$G$51,2,FALSE))","v":""},{"$nulls":3},"",{"$f":"IF(AB14=\"\",\"\",VLOOKUP(AB14,'11. Lists'!$F$36:$H$38,2,FALSE))","v":""},{"$f":"IF(AB14=\"\",\"\",VLOOKUP(AB14,'11. Lists'!$F$36:$H$38,3,FALSE))","v":""},"","","",{"$f":"IF(T14=\"\",\"\",VLOOKUP(T14,'11. Lists'!$B$47:$D$49,3,FALSE))","v":""},{"$f":"IF(D14=\"\",\"\",VLOOKUP(D14,'10. Condition and Temporal'!$B$6:$L$103,4,FALSE))","v":""}]
[null,5,{"$nulls":9},"","","",{"$nulls":5},{"$f":"IF(C15=\"\",\"\",VLOOKUP(D15,'9. All Habitats + Multipliers'!$C$4:$K$102,5,FALSE))","v":""},null,{"$f":"IF(T15=\"\",\"\",VLOOKUP(T15,'11. Lists'!$B$47:$D$49,2,FALSE))","v":""},{"$f":"IF(C15=\"\",\"\",VLOOKUP(D15,'10. Condition and Temporal'!$B$6:$C$103,2,FALSE))","v":""},{"$f":"IF(W15=\"\",\"\",VLOOKUP(W15,'11. Lists'!$F$47:$G$51,2,FALSE))","v":""},{"$nulls":3},"",{"$f":"IF(AB15=\"\",\"\",VLOOKUP(AB15,'11. Lists'!$F$36:$H$38,2,FALSE))","v":""},{"$f":"IF(AB15=\"\",\"\",VLOOKUP(AB15,'11. Lists'!$F$36:$H$38,3,FALSE))","v":""},"","","",{"$f":"IF(T15=\"\",\"\",VLOOKUP(T15,'11. Lists'!$B$47:$D$49,3,FALSE))","v":""},{"$f":"IF(D15=\"\",\"\",VLOOKUP(D15,'10. Condition and Temporal'!$B$6:$L$103,4,FALSE))","v":""}]
[null,6,{"$nulls":9},"","","",{"$nulls":5},{"$f":"IF(C16=\"\",\"\",VLOOKUP(D16,'9. All Habitats + Multipliers'!$C$4:$K$102,5,FALSE))","v":""},null,{"$f":"IF(T16=\"\",\"\",VLOOKUP(T16,'11. Lists'!$B$47:$D$49,2,FALSE))","v":""},{"$f":"IF(C16=\"\",\"\",VLOOKUP(D16,'10. Condition and Temporal'!$B$6:$C$103,2,FALSE))","v":""},{"$f":"IF(W16=\"\",\"\",VLOOKUP(W16,'11. Lists'!$F$47:$G$51,2,FALSE))","v":""},{"$nulls":3},"",{"$f":"IF(AB16=\"\",\"\",VLOOKUP(AB16,'11. Lists'!$F$36:$H$38,2,FALSE))","v":""},{"$f":"IF(AB16=\"\",\"\",VLOOKUP(AB16,'11. Lists'!$F$36:$H$38,3,FALSE))","v":""},"","","",{"$f":"IF(T16=\"\",\"\",VLOOKUP(T16,'11. Lists'!$B$47:$D$49,3,FALSE))","v":""},{"$f":"IF(D16=\"\",\"\",VLOOKUP(D16,'10. Condition and Temporal'!$B$6:$L$103,4,FALSE))","v":""}]
[null,7,{"$nulls":9},"","","",{"$nulls":5},{"$f":"IF(C17=\"\",\"\",VLOOKUP(D17,'9. All Habitats + Multipliers'!$C$4:$K$102,5,FALSE))","v":""},null,{"$f":"IF(T17=\"\",\"\",VLOOKUP(T17,'11. Lists'!$B$47:$D$49,2,FALSE))","v":""},{"$f":"IF(C17=\"\",\"\",VLOOKUP(D17,'10. Condition and Temporal'!$B$6:$C$103,2,FALSE))","v":""},{"$f":"IF(W17=\"\",\"\",VLOOKUP(W17,'11. Lists'!$F$47:$G$51,2,FALSE))","v":""},{"$nulls":3},"",{"$f":"IF(AB17=\"\",\"\",VLOOKUP(AB17,'11. Lists'!$F$36:$H$38,2,FALSE))","v":""},{"$f":"IF(AB17=\"\",\"\",VLOOKUP(AB17,'11. Lists'!$F$36:$H$38,3,FALSE))","v":""},"","","",{"$f":"IF(T17=\"\",\"\",VLOOKUP(T17,'11. Lists'!$B$47:$D$49,3,FALSE))","v":""},{"$f":"IF(D17=\"\",\"\",VLOOKUP(D17,'10. Condition and Temporal'!$B$6:$L$103,4,FALSE))","v":""}]
[null,8,{"$nulls":9},"","","",{"$nulls":5},{"$f":"IF(C18=\"\",\"\",VLOOKUP(D18,'9. All Habitats + Multipliers'!$C$4:$K$102,5,FALSE))","v":""},null,{"$f":"IF(T18=\"\",\"\",VLOOKUP(T18,'11. Lists'!$B$47:$D$49,2,FALSE))","v":""},{"$f":"IF(C18=\"\",\"\",VLOOKUP(D18,'10. Condition and Temporal'!$B$6:$C$103,2,FALSE))","v":""},{"$f":"IF(W18=\"\",\"\",VLOOKUP(W18,'11. Lists'!$F$47:$G$51,2,FALSE))","v":""},{"$nulls":3},"",{"$f":"IF(AB18=\"\",\"\",VLOOKUP(AB18,'11. Lists'!$F$36:$H$38,2,FALSE))","v":""},{"$f":"IF(AB18=\"\",\"\",VLOOKUP(AB18,'11. Lists'!$F$36:$H$38,3,FALSE))","v":""},"","","",{"$f":"IF(T18=\"\",\"\",VLOOKUP(T18,'11. Lists'!$B$47:$D$49,3,FALSE))","v":""},{"$f":"IF(D18=\"\",\"\",VLOOKUP(D18,'10. Condition and Temporal'!$B$6:$L$103,4,FALSE))","v":""}]
[null,9,{"$nulls":9},"","","",{"$nulls":5},{"$f":"IF(C19=\"\",\"\",VLOOKUP(D19,'9. All Habitats + Multipliers'!$C$4:$K$102,5,FALSE))","v":""},null,{"$f":"IF(T19=\"\",\"\",VLOOKUP(T19,'11. Lists'!$B$47:$D$49,2,FALSE))","v":""},{"$f":"IF(C19=\"\",\"\",VLOOKUP(D19,'10. Condition and Temporal'!$B$6:$C$103,2,FALSE))","v":""},{"$f":"IF(W19=\"\",\"\",VLOOKUP(W19,'11. Lists'!$F$47:$G$51,2,FALSE))","v":""},{"$nulls":3},"",{"$f":"IF(AB19=\"\",\"\",VLOOKUP(AB19,'11. Lists'!$F$36:$H$38,2,FALSE))","v":""},{"$f":"IF(AB19=\"\",\"\",VLOOKUP(AB19,'11. Lists'!$F$36:$H$38,3,FALSE))","v":""},"","","",{"$f":"IF(T19=\"\",\"\",VLOOKUP(T19,'11. Lists'!$B$47:$D$49,3,FALSE))","v":""},{"$f":"IF(D19=\"\",\"\",VLOOKUP(D19,'10. Condition and Temporal'!$B$6:$L$103,4,FALSE))","v":""}]
[null,10,{"$nulls":9},"","","",{"$nulls":5},{"$f":"IF(C20=\"\",\"\",VLOOKUP(D20,'9. All Habitats + Multipliers'!$C$4:$K$102,5,FALSE))","v":""},null,{"$f":"IF(T20=\"\",\"\",VLOOKUP(T20,'11. Lists'!$B$47:$D$49,2,FALSE))","v":""},{"$f":"IF(C20=\"\",\"\",VLOOKUP(D20,'10. Condition and Temporal'!$B$6:$C$103,2,FALSE))","v":""},{"$f":"IF(W20=\"\",\"\",VLOOKUP(W20,'11. Lists'!$F$47:$G$51,2,FALSE))","v":""},{"$nulls":3},"",{"$f":"IF(AB20=\"\",\"\",VLOOKUP(AB20,'11. Lists'!$F$36:$H$38,2,FALSE))","v":""},{"$f":"IF(AB20=\"\",\"\",VLOOKUP(AB20,'11. Lists'!$F$36:$H$38,3,FALSE))","v":""},"","","",{"$f":"IF(T20=\"\",\"\",VLOOKUP(T20,'11. Lists'!$B$47:$D$49,3,FALSE))","v":""},{"$f":"IF(D20=\"\",\"\",VLOOKUP(D20,'10. Condition and Temporal'!$B$6:$L$103,4,FALSE))","v":""}]
[null,11,{"$nulls":9},"","","",{"$nulls":5},{"$f":"IF(C21=\"\",\"\",VLOOKUP(D21,'9. All Habitats + Multipliers'!$C$4:$K$102,5,FALSE))","v":""},null,{"$f":"IF(T21=\"\",\"\",VLOOKUP(T21,'11. Lists'!$B$47:$D$49,2,FALSE))","v":""},{"$f":"IF(C21=\"\",\"\",VLOOKUP(D21,'10. Condition and Temporal'!$B$6:$C$103,2,FALSE))","v":""},{"$f":"IF(W21=\"\",\"\",VLOOKUP(W21,'11. Lists'!$F$47:$G$51,2,FALSE))","v":""},{"$nulls":3},"",{"$f":"IF(AB21=\"\",\"\",VLOOKUP(AB21,'11. Lists'!$F$36:$H$38,2,FALSE))","v":""},{"$f":"IF(AB21=\"\",\"\",VLOOKUP(AB21,'11. Lists'!$F$36:$H$38,3,FALSE))","v":""},"","","",{"$f":"IF(T21=\"\",\"\",VLOOKUP(T21,'11. Lists'!$B$47:$D$49,3,FALSE))","v":""},{"$f":"IF(D21=\"\",\"\",VLOOKUP(D21,'10. Condition and Temporal'!$B$6:$L$103,4,FALSE))","v":""}]
[null,12,{"$nulls":9},"","","",{"$nulls":5},{"$f":"IF(C22=\"\",\"\",VLOOKUP(D22,'9. All Habitats + Multipliers'!$C$4:$K$102,5,FALSE))","v":""},null,{"$f":"IF(T22=\"\",\"\",VLOOKUP(T22,'11. Lists'!$B$47:$D$49,2,FALSE))","v":""},{"$f":"IF(C22=\"\",\"\",VLOOKUP(D22,'10. Condition and Temporal'!$B$6:$C$103,2,FALSE))","v":""},{"$f":"IF(W22=\"\",\"\",VLOOKUP(W22,'11. Lists'!$F$47:$G$51,2,FALSE))","v":""},{"$nulls":3},"",{"$f":"IF(AB22=\"\",\"\",VLOOKUP(AB22,'11. Lists'!$F$36:$H$38,2,FALSE))","v":""},{"$f":"IF(AB22=\"\",\"\",VLOOKUP(AB22,'11. Lists'!$F$36:$H$38,3,FALSE))","v":""},"","","",{"$f":"IF(T22=\"\",\"\",VLOOKUP(T22,'11. Lists'!$B$47:$D$49,3,FALSE))","v":""},{"$f":"IF(D22=\"\",\"\",VLOOKUP(D22,'10. Condition and Temporal'!$B$6:$L$103,4,FALSE))","v":""}]
[null,13,{"$nulls":9},"","","",{"$nulls":5},{"$f":"IF(C23=\"\",\"\",VLOOKUP(D23,'9. All Habitats + Multipliers'!$C$4:$K$102,5,FALSE))","v":""},null,{"$f":"IF(T23=\"\",\"\",VLOOKUP(T23,'11. Lists'!$B$47:$D$49,2,FALSE))","v":""},{"$f":"IF(C23=\"\",\"\",VLOOKUP(D23,'10. Condition and Temporal'!$B$6:$C$103,2,FALSE))","v":""},{"$f":"IF(W23=\"\",\"\",VLOOKUP(W23,'11. Lists'!$F$47:$G$51,2,FALSE))","v":""},{"$nulls":3},"",{"$f":"IF(AB23=\"\",\"\",VLOOKUP(AB23,'11. Lists'!$F$36:$H$38,2,FALSE))","v":""},{"$f":"IF(AB23=\"\",\"\",VLOOKUP(AB23,'11. Lists'!$F$36:$H$38,3,FALSE))","v":""},"","","",{"$f":"IF(T23=\"\",\"\",VLOOKUP(T23,'11. Lists'!$B$47:$D$49,3,FALSE))","v":""},{"$f":"IF(D23=\"\",\"\",VLOOKUP(D23,'10. Condition and Temporal'!$B$6:$L$103,4,FALSE))","v":""}]
[null,14,{"$nulls":9},"","","",{"$nulls":5},{"$f":"IF(C24=\"\",\"\",VLOOKUP(D24,'9. All Habitats + Multipliers'!$C$4:$K$102,5,FALSE))","v":""},null,{"$f":"IF(T24=\"\",\"\",VLOOKUP(T24,'11. Lists'!$B$47:$D$49,2,FALSE))","v":""},{"$f":"IF(C24=\"\",\"\",VLOOKUP(D24,'10. Condition and Temporal'!$B$6:$C$103,2,FALSE))","v":""},{"$f":"IF(W24=\"\",\"\",VLOOKUP(W24,'11. Lists'!$F$47:$G$51,2,FALSE))","v":""},{"$nulls":3},"",{"$f":"IF(AB24=\"\",\"\",VLOOKUP(AB24,'11. Lists'!$F$36:$H$38,2,FALSE))","v":""},{"$f":"IF(AB24=\"\",\"\",VLOOKUP(AB24,'11. Lists'!$F$36:$H$38,3,FALSE))","v":""},"","","",{"$f":"IF(T24=\"\",\"\",VLOOKUP(T24,'11. Lists'!$B$47:$D$49,3,FALSE))","v":""},{"$f":"IF(D24=\"\",\"\",VLOOKUP(D24,'10. Condition and Temporal'!$B$6:$L$103,4,FALSE))","v":""}]
[null,15,{"$nulls":9},"","","",{"$nulls":5},{"$f":"IF(C25=\"\",\"\",VLOOKUP(D25,'9. All Habitats + Multipliers'!$C$4:$K$102,5,FALSE))","v":""},null,{"$f":"IF(T25=\"\",\"\",VLOOKUP(T25,'11. Lists'!$B$47:$D$49,2,FALSE))","v":""},{"$f":"IF(C25=\"\",\"\",VLOOKUP(D25,'10. Condition and Temporal'!$B$6:$C$103,2,FALSE))","v":""},{"$f":"IF(W25=\"\",\"\",VLOOKUP(W25,'11. Lists'!$F$47:$G$51,2,FALSE))","v":""},{"$nulls":3},"",{"$f":"IF(AB25=\"\",\"\",VLOOKUP(AB25,'11. Lists'!$F$36:$H$38,2,FALSE))","v":""},{"$f":"IF(AB25=\"\",\"\",VLOOKUP(AB25,'11. Lists'!$F$36:$H$38,3,FALSE))","v":""},"","","",{"$f":"IF(T25=\"\",\"\",VLOOKUP(T25,'11. Lists'!$B$47:$D$49,3,FALSE))","v":""},{"$f":"IF(D25=\"\",\"\",VLOOKUP(D25,'10. Condition and Temporal'!$B$6:$L$103,4,FALSE))","v":""}]
[null,16,{"$nulls":9},"","","",{"$nulls":5},{"$f":"IF(C26=\"\",\"\",VLOOKUP(D26,'9. All Habitats + Multipliers'!$C$4:$K$102,5,FALSE))","v":""},null,{"$f":"IF(T26=\"\",\"\",VLOOKUP(T26,'11. Lists'!$B$47:$D$49,2,FALSE))","v":""},{"$f":"IF(C26=\"\",\"\",VLOOKUP(D26,'10. Condition and Temporal'!$B$6:$C$103,2,FALSE))","v":""},{"$f":"IF(W26=\"\",\"\",VLOOKUP(W26,'11. Lists'!$F$47:$G$51,2,FALSE))","v":""},{"$nulls":3},"",{"$f":"IF(AB26=\"\",\"\",VLOOKUP(AB26,'11. Lists'!$F$36:$H$38,2,FALSE))","v":""},{"$f":"IF(AB26=\"\",\"\",VLOOKUP(AB26,'11. Lists'!$F$36:$H$38,3,FALSE))","v":""},"","","",{"$f":"IF(T26=\"\",\"\",VLOOKUP(T26,'11. Lists'!$B$47:$D$49,3,FALSE))","v":""},{"$f":"IF(D26=\"\",\"\",VLOOKUP(D26,'10. Condition and Temporal'!$B$6:$L$103,4,FALSE))","v":""}]
[null,17,{"$nulls":9},"","","",{"$nulls":5},{"$f":"IF(C27=\"\",\"\",VLOOKUP(D27,'9. All Habitats + Multipliers'!$C$4:$K$102,5,FALSE))","v":""},null,{"$f":"IF(T27=\"\",\"\",VLOOKUP(T27,'11. Lists'!$B$47:$D$49,2,FALSE))","v":""},{"$f":"IF(C27=\"\",\"\",VLOOKUP(D27,'10. Condition and Temporal'!$B$6:$C$103,2,FALSE))","v":""},{"$f":"IF(W27=\"\",\"\",VLOOKUP(W27,'11. Lists'!$F$47:$G$51,2,FALSE))","v":""},{"$nulls":3},"",{"$f":"IF(AB27=\"\",\"\",VLOOKUP(AB27,'11. Lists'!$F$36:$H$38,2,FALSE))","v":""},{"$f":"IF(AB27=\"\",\"\",VLOOKUP(AB27,'11. Lists'!$F$36:$H$38,3,FALSE))","v":""},"","","",{"$f":"IF(T27=\"\",\"\",VLOOKUP(T27,'11. Lists'!$B$47:$D$49,3,FALSE))","v":""},{"$f":"IF(D27=\"\",\"\",VLOOKUP(D27,'10. Condition and Temporal'!$B$6:$L$103,4,FALSE))","v":""}]
[null,18,{"$nulls":9},"","","",{"$nulls":5},{"$f":"IF(C28=\"\",\"\",VLOOKUP(D28,'9. All Habitats + Multipliers'!$C$4:$K$102,5,FALSE))","v":""},null,{"$f":"IF(T28=\"\",\"\",VLOOKUP(T28,'11. Lists'!$B$47:$D$49,2,FALSE))","v":""},{"$f":"IF(C28=\"\",\"\",VLOOKUP(D28,'10. Condition and Temporal'!$B$6:$C$103,2,FALSE))","v":""},{"$f":"IF(W28=\"\",\"\",VLOOKUP(W28,'11. Lists'!$F$47:$G$51,2,FALSE))","v":""},{"$nulls":3},"",{"$f":"IF(AB28=\"\",\"\",VLOOKUP(AB28,'11. Lists'!$F$36:$H$38,2,FALSE))","v":""},{"$f":"IF(AB28=\"\",\"\",VLOOKUP(AB28,'11. Lists'!$F$36:$H$38,3,FALSE))","v":""},"","","",{"$f":"IF(T28=\"\",\"\",VLOOKUP(T28,'11. Lists'!$B$47:$D$49,3,FALSE))","v":""},{"$f":"IF(D28=\"\",\"\",VLOOKUP(D28,'10. Condition and Temporal'!$B$6:$L$103,4,FALSE))","v":""}]
[null,19,{"$nulls":9},"","","",{"$nulls":5},{"$f":"IF(C29=\"\",\"\",VLOOKUP(D29,'9. All Habitats + Multipliers'!$C$4:$K$102,5,FALSE))","v":""},null,{"$f":"IF(T29=\"\",\"\",VLOOKUP(T29,'11. Lists'!$B$47:$D$49,2,FALSE))","v":""},{"$f":"IF(C29=\"\",\"\",VLOOKUP(D29,'10. Condition and Temporal'!$B$6:$C$103,2,FALSE))","v":""},{"$f":"IF(W29=\"\",\"\",VLOOKUP(W29,'11. Lists'!$F$47:$G$51,2,FALSE))","v":""},{"$nulls":3},"",{"$f":"IF(AB29=\"\",\"\",VLOOKUP(AB29,'11. Lists'!$F$36:$H$38,2,FALSE))","v":""},{"$f":"IF(AB29=\"\",\"\",VLOOKUP(AB29,'11. Lists'!$F$36:$H$38,3,FALSE))","v":""},"","","",{"$f":"IF(T29=\"\",\"\",VLOOKUP(T29,'11. Lists'!$B$47:$D$49,3,FALSE))","v":""},{"$f":"IF(D29=\"\",\"\",VLOOKUP(D29,'10. Condition and Temporal'!$B$6:$L$103,4,FALSE))","v":""}]
[null,20,{"$nulls":9},"","","",{"$nulls":5},{"$f":"IF(C30=\"\",\"\",VLOOKUP(D30,'9. All Habitats + Multipliers'!$C$4:$K$102,5,FALSE))","v":""},null,{"$f":"IF(T30=\"\",\"\",VLOOKUP(T30,'11. Lists'!$B$47:$D$49,2,FALSE))","v":""},{"$f":"IF(C30=\"\",\"\",VLOOKUP(D30,'10. Condition and Temporal'!$B$6:$C$103,2,FALSE))","v":""},{"$f":"IF(W30=\"\",\"\",VLOOKUP(W30,'11. Lists'!$F$47:$G$51,2,FALSE))","v":""},{"$nulls":3},"",{"$f":"IF(AB30=\"\",\"\",VLOOKUP(AB30,'11. Lists'!$F$36:$H$38,2,FALSE))","v":""},{"$f":"IF(AB30=\"\",\"\",VLOOKUP(AB30,'11. Lists'!$F$36:$H$38,3,FALSE))","v":""},"","","",{"$f":"IF(T30=\"\",\"\",VLOOKUP(T30,'11. Lists'!$B$47:$D$49,3,FALSE))","v":""},{"$f":"IF(D30=\"\",\"\",VLOOKUP(D30,'10. Condition and Temporal'!$B$6:$L$103,4,FALSE))","v":""}]
[null,"Trees","Individual trees","Urban/rural tree",null,"Formally identified in local strategy",null,null,{"$f":"I99","v":{"v":244.1664,"d":"244.17"}},{"$f":"L99","v":{"v":203.472,"d":"203.47"}},null,{"$f":"IF(C31=\"\",\"\",((I31/10000)*V31*X31)*AD31)","v":{"v":0.22463308799999998,"d":"0.2246"}},{"$f":"IF(C31=\"\",\"\",I31-J31-K31)","v":{"v":40.6944,"d":"40.69"}},{"$f":"IF(C31=\"\",\"\",((M31/10000)*V31*X31)*AD31)","v":{"v":0.037438848000000004,"d":"0.0374"}},{"$nulls":5},{"$f":"IF(C31=\"\",\"\",VLOOKUP(D31,'9. All Habitats + Multipliers'!$C$4:$K$102,5,FALSE))","v":"Medium"},null,{"$f":"IF(T31=\"\",\"\",VLOOKUP(T31,'11. Lists'!$B$47:$D$49,2,FALSE))","v":4},{"$f":"IF(C31=\"\",\"\",VLOOKUP(D31,'10. Condition and Temporal'!$B$6:$C$103,2,FALSE))","v":"Moderate"},{"$f":"IF(W31=\"\",\"\",VLOOKUP(W31,'11. Lists'!$F$47:$G$51,2,FALSE))","v":2},{"$nulls":3},{"$f":"IF(F31=\"\",\"\",F31)","v":"Formally identified in local strategy"},{"$f":"IF(AB31=\"\",\"\",VLOOKUP(AB31,'11. Lists'!$F$36:$H$38,2,FALSE))","v":"High strategic significance "},{"$f":"IF(AB31=\"\",\"\",VLOOKUP(AB31,'11. Lists'!$F$36:$H$38,3,FALSE))","v":1.15},{"$f":"IF(D31=\"\",\"\",((J31/10000)*V31*X31)*(AD31))","v":{"v":0.18719423999999998,"d":"0.19"}},{"$f":"IF(D31=\"\",\"\",((K31/10000)*V31*X31)*(AD31))","v":{"v":0,"d":"0.00"}},{"v":40.6944,"d":"40.69"},{"$f":"IF(T31=\"\",\"\",VLOOKUP(T31,'11. Lists'!$B$47:$D$49,3,FALSE))","v":"Same broad habitat or a higher distinctiveness habitat required"},{"$f":"IF(D31=\"\",\"\",VLOOKUP(D31,'10. Condition and Temporal'!$B$6:$L$103,4,FALSE))","v":"Urban/rural tree"}]
[{"$nulls":7},"Totals (areas excl trees, green walls and intertidal hard structures)",{"$f":"SUMIFS(I11:I30,D11:D30,\"<>\"&'11. Lists'!Q10,D11:D30,\"<>\"&'11. Lists'!Q11,D11:D30,\"<>\"&'11. Lists'!I4,D11:D30,\"<>\"&'11. Lists'!I2,D11:D30,\"<>\"&'11. Lists'!I3)","v":{"v":270,"d":"270.00"}},{"$f":"SUMIFS(J11:J30,D11:D30,\"<>\"&'11. Lists'!Q10,D11:D30,\"<>\"&'11. Lists'!Q11,D11:D30,\"<>\"&'11. Lists'!I4,D11:D30,\"<>\"&'11. Lists'!I2,D11:D30,\"<>\"&'11. Lists'!I3)","v":{"v":0,"d":"0.00"}},{"$f":"SUMIFS(K11:K30,D11:D30,\"<>\"&'11. Lists'!Q10,D11:D30,\"<>\"&'11. Lists'!Q11,D11:D30,\"<>\"&'11. Lists'!I4,D11:D30,\"<>\"&'11. Lists'!I2,D11:D30,\"<>\"&'11. Lists'!I3)","v":{"v":0,"d":"0.00"}},{"$f":"SUM(L11:L31)","v":{"v":0.27363308799999997,"d":"0.2736"}},{"$f":"SUMIFS(M11:M30,D11:D30,\"<>\"&'11. Lists'!Q10,D11:D30,\"<>\"&'11. Lists'!Q11,D11:D30,\"<>\"&'11. Lists'!I4,D11:D30,\"<>\"&'11. Lists'!I2,D11:D30,\"<>\"&'11. Lists'!I3)","v":{"v":270,"d":"270.00"}},{"$f":"SUM(N11:N31)","v":{"v":0.08643884800000001,"d":"0.0864"}}]
[{"$nulls":7},"Error Check 1",{"$f":"IF(I32=0, \"Areas Acceptable ✓\", IF(AND('3. Desktop Assessment'!C6=\"Residential\", I32<10000, '3. Desktop Assessment'!C9=\"Between 1 - 9 dwellings\"),\"Areas Acceptable ✓\", IF(AND('3. Desktop Assessment'!C6=\"Residential\", I32<5000, '3. Desktop Assessment'!C9=\"Unknown number\"), \"Areas Acceptable ✓\", IF(AND('3. Desktop Assessment'!C6=\"Commercial\", I32<10000, '3. Desktop Assessment'!C8<1000),\"Areas Acceptable ✓\", IF(AND('3. Desktop Assessment'!C6=\"Mixed\", I32<10000, '3. Desktop Assessment'!C9=\"Between 1 - 9 dwellings\",  '3. Desktop Assessment'!C8<1000),\"Areas Acceptable ✓\", IF(AND('3. Desktop Assessment'!C6=\"Mixed\", I32<5000, '3. Desktop Assessment'!C9=\"Unknown number\",  '3. Desktop Assessment'!C8<1000), \"Areas Acceptable ✓\", IF(AND('3. Desktop Assessment'!C6=\"Other\", I32<10000),\"Areas Acceptable ✓\", \"Error - Site exceeds areas appropriate for the small sites metric ▲\")))))))","v":"Areas Acceptable ✓"},{"$nulls":5},{"$f":"IFERROR(FIND(\"Error\",I33),0)","v":0}]
[{"$nulls":7},"Error Check 2",{"$f":"IF(I32<J32+K32,\"Error - Areas Retained and Enhanced Exceed Total Area ▲\",\"Areas Acceptable ✓\")","v":"Areas Acceptable ✓"},{"$nulls":5},{"$f":"IFERROR(FIND(\"Error\",I34),0)","v":0}]
[{"$nulls":7},"Error Check 3",{"$f":"IF(I32=0,\"Areas Acceptable ✓\",IF(I32<>'3. Desktop Assessment'!C7,\"Error - Areas Entered Does Not Match Stated Site Area ▲\",\"Areas Acceptable ✓\"))","v":"Areas Acceptable ✓"},{"$nulls":5},{"$f":"IFERROR(FIND(\"Error\",I35),0)","v":0},null,null,"Data beyond this column is automated"]
[null,"1b. Habitats to be created",{"$nulls":12},{"$f":"COUNTIF(L11:N30,\"*\"&\"error\"&\"*\")","v":0}]
[]
[null,"Ref",null,null,"Condition Assessment",null,null,"D. Strategic significance","E. Total Area  (m2)",null,null,"Habitat units created onsite",null,null,"Comments",{"$nulls":4},"Habitat distinctiveness",null,null,"Habitat condition",{"$nulls":4},"Strategic significance",null,null,"Temporal multiplier",null,"Difficulty multipliers"]
[null,null,"A. Broad Habitat","B. Habitat type","Acceptable condition options","C. Targeted condition",{"$nulls":8},"User comments","LPA comments",{"$nulls":3},"Distinctiveness",null,"Score","Condition ","Score",{"$nulls":3},"Strategic significance","Strategic significance","Strategic significance multiplier","Time to target condition/years","Time to target multiplier","Difficulty of creation category","Difficulty of creation multiplier"]
[null,1,"Urban","Vegetated garden",{"$f":"IF(D40=\"\",\"\",VLOOKUP(D40,'10. Condition and Temporal'!$B$6:$D$103,3,FALSE))","v":"Condition Assessment N/A"},"Condition Assessment N/A",null,"Area/compensation not in local strategy/ no local strategy",{"v":65,"d":"65.00"},null,null,{"$f":"IF(C40=\"\",\"\",IFERROR(IF(I40=\"\",\"\",((I40/10000)*(V40*X40))*(AH40*AF40)*AD40),\"This intervention is not permitted within the SSM ▲\"))","v":{"v":0.012544999999999999,"d":"0.0125"}},null,null,"Lawn",{"$nulls":4},{"$f":"IF(C40=\"\",\"\",VLOOKUP(D40,'9. All Habitats + Multipliers'!$C$4:$K$102,5,FALSE))","v":"Low"},null,{"$f":"IF(T40=\"\",\"\",VLOOKUP(T40,'11. Lists'!$B$47:$D$49,2,FALSE))","v":2},{"$f":"IF(F40=\"\",\"\",F40)","v":"Condition Assessment N/A"},{"$f":"IF(W40=\"\",\"\",VLOOKUP(W40,'11. Lists'!$F$47:$G$51,2,FALSE))","v":1},{"$nulls":3},{"$f":"IF(H40=\"\",\"\",H40)","v":"Area/compensation not in local strategy/ no local strategy"},{"$f":"IF(AB40=\"\",\"\",VLOOKUP(AB40,'11. Lists'!$F$36:$H$38,2,FALSE))","v":"Low Strategic Significance"},{"$f":"IF(AB40=\"\",\"\",VLOOKUP(AB40,'11. Lists'!$F$36:$H$38,3,FALSE))","v":1},{"$f":"IF(F40=\"\",\"\",IF(F40=\"Moderate\",VLOOKUP(D40,'10. Condition and Temporal'!$B$6:$L$103,6,FALSE),IF(F40=\"Good\",VLOOKUP(D40,'10. Condition and Temporal'!$B$6:$L$103,7,FALSE),IF(F40=\"Poor\",VLOOKUP(D40,'10. Condition and Temporal'!$B$6:$L$103,8,FALSE),IF(F40=\"Condition Assessment N/A\",VLOOKUP(D40,'10. Condition and Temporal'!$B$6:$L$103,9,FALSE),IF(F40=\"N/A - Other\",VLOOKUP(D40,'10. Condition and Temporal'!$B$6:$L$103,10,FALSE)))))))","v":1},{"$f":"IF(AE40=\"\",\"\",VLOOKUP(AE40,'11. Lists'!$I$47:$K$80,3,FALSE))","v":0.965},{"$f":"IF(D40=\"\",\"\",VLOOKUP(D40,'9. All Habitats + Multipliers'!$C$4:$K$102,7,FALSE))","v":"Low"},{"$f":"IF(AG40=\"\",\"\",VLOOKUP(AG40,'11. Lists'!$J$35:$K$38,2,FALSE))","v":1}]
[null,2,"Urban","Developed land; sealed surface",{"$f":"IF(D41=\"\",\"\",VLOOKUP(D41,'10. Condition and Temporal'!$B$6:$D$103,3,FALSE))","v":"N/A - Other"},"N/A - Other",null,"Area/compensation not in local strategy/ no local strategy",{"v":24,"d":"24.00"},null,null,{"$f":"IF(C41=\"\",\"\",IFERROR(IF(I41=\"\",\"\",((I41/10000)*(V41*X41))*(AH41*AF41)*AD41),\"This intervention is not permitted within the SSM ▲\"))","v":{"v":0,"d":"0.0000"}},null,null,"Paving slabs",{"$nulls":4},{"$f":"IF(C41=\"\",\"\",VLOOKUP(D41,'9. All Habitats + Multipliers'!$C$4:$K$102,5,FALSE))","v":"V.Low"},null,{"$f":"IF(T41=\"\",\"\",VLOOKUP(T41,'11. Lists'!$B$47:$D$49,2,FALSE))","v":0},{"$f":"IF(F41=\"\",\"\",F41)","v":"N/A - Other"},{"$f":"IF(W41=\"\",\"\",VLOOKUP(W41,'11. Lists'!$F$47:$G$51,2,FALSE))","v":0},{"$nulls":3},{"$f":"IF(H41=\"\",\"\",H41)","v":"Area/compensation not in local strategy/ no local strategy"},{"$f":"IF(AB41=\"\",\"\",VLOOKUP(AB41,'11. Lists'!$F$36:$H$38,2,FALSE))","v":"Low Strategic Significance"},{"$f":"IF(AB41=\"\",\"\",VLOOKUP(AB41,'11. Lists'!$F$36:$H$38,3,FALSE))","v":1},{"$f":"IF(F41=\"\",\"\",IF(F41=\"Moderate\",VLOOKUP(D41,'10. Condition and Temporal'!$B$6:$L$103,6,FALSE),IF(F41=\"Good\",VLOOKUP(D41,'10. Condition and Temporal'!$B$6:$L$103,7,FALSE),IF(F41=\"Poor\",VLOOKUP(D41,'10. Condition and Temporal'!$B$6:$L$103,8,FALSE),IF(F41=\"Condition Assessment N/A\",VLOOKUP(D41,'10. Condition and Temporal'!$B$6:$L$103,9,FALSE),IF(F41=\"N/A - Other\",VLOOKUP(D41,'10. Condition and Temporal'!$B$6:$L$103,10,FALSE)))))))","v":0},{"$f":"IF(AE41=\"\",\"\",VLOOKUP(AE41,'11. Lists'!$I$47:$K$80,3,FALSE))","v":{"v":1,"d":"1.000"}},{"$f":"IF(D41=\"\",\"\",VLOOKUP(D41,'9. All Habitats + Multipliers'!$C$4:$K$102,7,FALSE))","v":"Low"},{"$f":"IF(AG41=\"\",\"\",VLOOKUP(AG41,'11. Lists'!$J$35:$K$38,2,FALSE))","v":1}]
[null,3,"Urban","Artificial unvegetated, unsealed surface",{"$f":"IF(D42=\"\",\"\",VLOOKUP(D42,'10. Condition and Temporal'!$B$6:$D$103,3,FALSE))","v":"N/A - Other"},"N/A - Other",null,"Area/compensation not in local strategy/ no local strategy",{"v":81,"d":"81.00"},null,null,{"v":0,"d":"0.0000"},null,null,"Gravel driveway",{"$nulls":4},{"$f":"IF(C42=\"\",\"\",VLOOKUP(D42,'9. All Habitats + Multipliers'!$C$4:$K$102,5,FALSE))","v":"V.Low"},null,{"$f":"IF(T42=\"\",\"\",VLOOKUP(T42,'11. Lists'!$B$47:$D$49,2,FALSE))","v":0},{"$f":"IF(F42=\"\",\"\",F42)","v":"N/A - Other"},{"$f":"IF(W42=\"\",\"\",VLOOKUP(W42,'11. Lists'!$F$47:$G$51,2,FALSE))","v":0},{"$nulls":3},"Area/compensation not in local strategy/ no local strategy",{"$f":"IF(AB42=\"\",\"\",VLOOKUP(AB42,'11. Lists'!$F$36:$H$38,2,FALSE))","v":"Low Strategic Significance"},{"$f":"IF(AB42=\"\",\"\",VLOOKUP(AB42,'11. Lists'!$F$36:$H$38,3,FALSE))","v":1},{"$f":"IF(F42=\"\",\"\",IF(F42=\"Moderate\",VLOOKUP(D42,'10. Condition and Temporal'!$B$6:$L$103,6,FALSE),IF(F42=\"Good\",VLOOKUP(D42,'10. Condition and Temporal'!$B$6:$L$103,7,FALSE),IF(F42=\"Poor\",VLOOKUP(D42,'10. Condition and Temporal'!$B$6:$L$103,8,FALSE),IF(F42=\"Condition Assessment N/A\",VLOOKUP(D42,'10. Condition and Temporal'!$B$6:$L$103,9,FALSE),IF(F42=\"N/A - Other\",VLOOKUP(D42,'10. Condition and Temporal'!$B$6:$L$103,10,FALSE)))))))","v":0},{"$f":"IF(AE42=\"\",\"\",VLOOKUP(AE42,'11. Lists'!$I$47:$K$80,3,FALSE))","v":{"v":1,"d":"1.000"}},{"$f":"IF(D42=\"\",\"\",VLOOKUP(D42,'9. All Habitats + Multipliers'!$C$4:$K$102,7,FALSE))","v":"Low"},{"$f":"IF(AG42=\"\",\"\",VLOOKUP(AG42,'11. Lists'!$J$35:$K$38,2,FALSE))","v":1}]
[null,4,"Urban","Developed land; sealed surface",{"$f":"IF(D43=\"\",\"\",VLOOKUP(D43,'10. Condition and Temporal'!$B$6:$D$103,3,FALSE))","v":"N/A - Other"},"N/A - Other",null,"Area/compensation not in local strategy/ no local strategy",{"v":75,"d":"75.00"},null,null,{"v":0,"d":"0.0000"},null,null,"Footprint of dwelling",{"$nulls":4},{"$f":"IF(C43=\"\",\"\",VLOOKUP(D43,'9. All Habitats + Multipliers'!$C$4:$K$102,5,FALSE))","v":"V.Low"},null,{"$f":"IF(T43=\"\",\"\",VLOOKUP(T43,'11. Lists'!$B$47:$D$49,2,FALSE))","v":0},{"$f":"IF(F43=\"\",\"\",F43)","v":"N/A - Other"},{"$f":"IF(W43=\"\",\"\",VLOOKUP(W43,'11. Lists'!$F$47:$G$51,2,FALSE))","v":0},{"$nulls":3},"Area/compensation not in local strategy/ no local strategy",{"$f":"IF(AB43=\"\",\"\",VLOOKUP(AB43,'11. Lists'!$F$36:$H$38,2,FALSE))","v":"Low Strategic Significance"},{"$f":"IF(AB43=\"\",\"\",VLOOKUP(AB43,'11. Lists'!$F$36:$H$38,3,FALSE))","v":1},{"$f":"IF(F43=\"\",\"\",IF(F43=\"Moderate\",VLOOKUP(D43,'10. Condition and Temporal'!$B$6:$L$103,6,FALSE),IF(F43=\"Good\",VLOOKUP(D43,'10. Condition and Temporal'!$B$6:$L$103,7,FALSE),IF(F43=\"Poor\",VLOOKUP(D43,'10. Condition and Temporal'!$B$6:$L$103,8,FALSE),IF(F43=\"Condition Assessment N/A\",VLOOKUP(D43,'10. Condition and Temporal'!$B$6:$L$103,9,FALSE),IF(F43=\"N/A - Other\",VLOOKUP(D43,'10. Condition and Temporal'!$B$6:$L$103,10,FALSE)))))))","v":0},{"$f":"IF(AE43=\"\",\"\",VLOOKUP(AE43,'11. Lists'!$I$47:$K$80,3,FALSE))","v":{"v":1,"d":"1.000"}},{"$f":"IF(D43=\"\",\"\",VLOOKUP(D43,'9. All Habitats + Multipliers'!$C$4:$K$102,7,FALSE))","v":"Low"},{"$f":"IF(AG43=\"\",\"\",VLOOKUP(AG43,'11. Lists'!$J$35:$K$38,2,FALSE))","v":1}]
[null,5,"Urban","Introduced shrub",{"$f":"IF(D44=\"\",\"\",VLOOKUP(D44,'10. Condition and Temporal'!$B$6:$D$103,3,FALSE))","v":"Condition Assessment N/A"},"Condition Assessment N/A",null,"Area/compensation not in local strategy/ no local strategy",{"v":25,"d":"25.00"},null,null,{"v":0.004825,"d":"0.0048"},null,null,"Cotoneaster, Laurel",{"$nulls":4},{"$f":"IF(C44=\"\",\"\",VLOOKUP(D44,'9. All Habitats + Multipliers'!$C$4:$K$102,5,FALSE))","v":"Low"},null,{"$f":"IF(T44=\"\",\"\",VLOOKUP(T44,'11. Lists'!$B$47:$D$49,2,FALSE))","v":2},{"$f":"IF(F44=\"\",\"\",F44)","v":"Condition Assessment N/A"},{"$f":"IF(W44=\"\",\"\",VLOOKUP(W44,'11. Lists'!$F$47:$G$51,2,FALSE))","v":1},{"$nulls":3},"Area/compensation not in local strategy/ no local strategy",{"$f":"IF(AB44=\"\",\"\",VLOOKUP(AB44,'11. Lists'!$F$36:$H$38,2,FALSE))","v":"Low Strategic Significance"},{"$f":"IF(AB44=\"\",\"\",VLOOKUP(AB44,'11. Lists'!$F$36:$H$38,3,FALSE))","v":1},{"$f":"IF(F44=\"\",\"\",IF(F44=\"Moderate\",VLOOKUP(D44,'10. Condition and Temporal'!$B$6:$L$103,6,FALSE),IF(F44=\"Good\",VLOOKUP(D44,'10. Condition and Temporal'!$B$6:$L$103,7,FALSE),IF(F44=\"Poor\",VLOOKUP(D44,'10. Condition and Temporal'!$B$6:$L$103,8,FALSE),IF(F44=\"Condition Assessment N/A\",VLOOKUP(D44,'10. Condition and Temporal'!$B$6:$L$103,9,FALSE),IF(F44=\"N/A - Other\",VLOOKUP(D44,'10. Condition and Temporal'!$B$6:$L$103,10,FALSE)))))))","v":1},{"$f":"IF(AE44=\"\",\"\",VLOOKUP(AE44,'11. Lists'!$I$47:$K$80,3,FALSE))","v":0.965},{"$f":"IF(D44=\"\",\"\",VLOOKUP(D44,'9. All Habitats + Multipliers'!$C$4:$K$102,7,FALSE))","v":"Low"},{"$f":"IF(AG44=\"\",\"\",VLOOKUP(AG44,'11. Lists'!$J$35:$K$38,2,FALSE))","v":1}]
[null,6,null,null,{"$f":"IF(D45=\"\",\"\",VLOOKUP(D45,'10. Condition and Temporal'!$B$6:$D$103,3,FALSE))","v":""},{"$nulls":6},"",{"$nulls":7},{"$f":"IF(C45=\"\",\"\",VLOOKUP(D45,'9. All Habitats + Multipliers'!$C$4:$K$102,5,FALSE))","v":""},null,{"$f":"IF(T45=\"\",\"\",VLOOKUP(T45,'11. Lists'!$B$47:$D$49,2,FALSE))","v":""},"",{"$f":"IF(W45=\"\",\"\",VLOOKUP(W45,'11. Lists'!$F$47:$G$51,2,FALSE))","v":""},{"$nulls":3},"",{"$f":"IF(AB45=\"\",\"\",VLOOKUP(AB45,'11. Lists'!$F$36:$H$38,2,FALSE))","v":""},{"$f":"IF(AB45=\"\",\"\",VLOOKUP(AB45,'11. Lists'!$F$36:$H$38,3,FALSE))","v":""},{"$f":"IF(F45=\"\",\"\",IF(F45=\"Moderate\",VLOOKUP(D45,'10. Condition and Temporal'!$B$6:$L$103,6,FALSE),IF(F45=\"Good\",VLOOKUP(D45,'10. Condition and Temporal'!$B$6:$L$103,7,FALSE),IF(F45=\"Poor\",VLOOKUP(D45,'10. Condition and Temporal'!$B$6:$L$103,8,FALSE),IF(F45=\"Condition Assessment N/A\",VLOOKUP(D45,'10. Condition and Temporal'!$B$6:$L$103,9,FALSE),IF(F45=\"N/A - Other\",VLOOKUP(D45,'10. Condition and Temporal'!$B$6:$L$103,10,FALSE)))))))","v":""},{"$f":"IF(AE45=\"\",\"\",VLOOKUP(AE45,'11. Lists'!$I$47:$K$80,3,FALSE))","v":""},{"$f":"IF(D45=\"\",\"\",VLOOKUP(D45,'9. All Habitats + Multipliers'!$C$4:$K$102,7,FALSE))","v":""},{"$f":"IF(AG45=\"\",\"\",VLOOKUP(AG45,'11. Lists'!$J$35:$K$38,2,FALSE))","v":""}]
[null,7,null,null,{"$f":"IF(D46=\"\",\"\",VLOOKUP(D46,'10. Condition and Temporal'!$B$6:$D$103,3,FALSE))","v":""},{"$nulls":6},"",{"$nulls":7},{"$f":"IF(C46=\"\",\"\",VLOOKUP(D46,'9. All Habitats + Multipliers'!$C$4:$K$102,5,FALSE))","v":""},null,{"$f":"IF(T46=\"\",\"\",VLOOKUP(T46,'11. Lists'!$B$47:$D$49,2,FALSE))","v":""},"",{"$f":"IF(W46=\"\",\"\",VLOOKUP(W46,'11. Lists'!$F$47:$G$51,2,FALSE))","v":""},{"$nulls":3},"",{"$f":"IF(AB46=\"\",\"\",VLOOKUP(AB46,'11. Lists'!$F$36:$H$38,2,FALSE))","v":""},{"$f":"IF(AB46=\"\",\"\",VLOOKUP(AB46,'11. Lists'!$F$36:$H$38,3,FALSE))","v":""},{"$f":"IF(F46=\"\",\"\",IF(F46=\"Moderate\",VLOOKUP(D46,'10. Condition and Temporal'!$B$6:$L$103,6,FALSE),IF(F46=\"Good\",VLOOKUP(D46,'10. Condition and Temporal'!$B$6:$L$103,7,FALSE),IF(F46=\"Poor\",VLOOKUP(D46,'10. Condition and Temporal'!$B$6:$L$103,8,FALSE),IF(F46=\"Condition Assessment N/A\",VLOOKUP(D46,'10. Condition and Temporal'!$B$6:$L$103,9,FALSE),IF(F46=\"N/A - Other\",VLOOKUP(D46,'10. Condition and Temporal'!$B$6:$L$103,10,FALSE)))))))","v":""},{"$f":"IF(AE46=\"\",\"\",VLOOKUP(AE46,'11. Lists'!$I$47:$K$80,3,FALSE))","v":""},{"$f":"IF(D46=\"\",\"\",VLOOKUP(D46,'9. All Habitats + Multipliers'!$C$4:$K$102,7,FALSE))","v":""},{"$f":"IF(AG46=\"\",\"\",VLOOKUP(AG46,'11. Lists'!$J$35:$K$38,2,FALSE))","v":""}]
[null,8,null,null,{"$f":"IF(D47=\"\",\"\",VLOOKUP(D47,'10. Condition and Temporal'!$B$6:$D$103,3,FALSE))","v":""},{"$nulls":6},"",{"$nulls":7},{"$f":"IF(C47=\"\",\"\",VLOOKUP(D47,'9. All Habitats + Multipliers'!$C$4:$K$102,5,FALSE))","v":""},null,{"$f":"IF(T47=\"\",\"\",VLOOKUP(T47,'11. Lists'!$B$47:$D$49,2,FALSE))","v":""},"",{"$f":"IF(W47=\"\",\"\",VLOOKUP(W47,'11. Lists'!$F$47:$G$51,2,FALSE))","v":""},{"$nulls":3},"",{"$f":"IF(AB47=\"\",\"\",VLOOKUP(AB47,'11. Lists'!$F$36:$H$38,2,FALSE))","v":""},{"$f":"IF(AB47=\"\",\"\",VLOOKUP(AB47,'11. Lists'!$F$36:$H$38,3,FALSE))","v":""},{"$f":"IF(F47=\"\",\"\",IF(F47=\"Moderate\",VLOOKUP(D47,'10. Condition and Temporal'!$B$6:$L$103,6,FALSE),IF(F47=\"Good\",VLOOKUP(D47,'10. Condition and Temporal'!$B$6:$L$103,7,FALSE),IF(F47=\"Poor\",VLOOKUP(D47,'10. Condition and Temporal'!$B$6:$L$103,8,FALSE),IF(F47=\"Condition Assessment N/A\",VLOOKUP(D47,'10. Condition and Temporal'!$B$6:$L$103,9,FALSE),IF(F47=\"N/A - Other\",VLOOKUP(D47,'10. Condition and Temporal'!$B$6:$L$103,10,FALSE)))))))","v":""},{"$f":"IF(AE47=\"\",\"\",VLOOKUP(AE47,'11. Lists'!$I$47:$K$80,3,FALSE))","v":""},{"$f":"IF(D47=\"\",\"\",VLOOKUP(D47,'9. All Habitats + Multipliers'!$C$4:$K$102,7,FALSE))","v":""},{"$f":"IF(AG47=\"\",\"\",VLOOKUP(AG47,'11. Lists'!$J$35:$K$38,2,FALSE))","v":""}]
[null,9,null,null,{"$f":"IF(D48=\"\",\"\",VLOOKUP(D48,'10. Condition and Temporal'!$B$6:$D$103,3,FALSE))","v":""},{"$nulls":6},"",{"$nulls":7},{"$f":"IF(C48=\"\",\"\",VLOOKUP(D48,'9. All Habitats + Multipliers'!$C$4:$K$102,5,FALSE))","v":""},null,{"$f":"IF(T48=\"\",\"\",VLOOKUP(T48,'11. Lists'!$B$47:$D$49,2,FALSE))","v":""},"",{"$f":"IF(W48=\"\",\"\",VLOOKUP(W48,'11. Lists'!$F$47:$G$51,2,FALSE))","v":""},{"$nulls":3},"",{"$f":"IF(AB48=\"\",\"\",VLOOKUP(AB48,'11. Lists'!$F$36:$H$38,2,FALSE))","v":""},{"$f":"IF(AB48=\"\",\"\",VLOOKUP(AB48,'11. Lists'!$F$36:$H$38,3,FALSE))","v":""},{"$f":"IF(F48=\"\",\"\",IF(F48=\"Moderate\",VLOOKUP(D48,'10. Condition and Temporal'!$B$6:$L$103,6,FALSE),IF(F48=\"Good\",VLOOKUP(D48,'10. Condition and Temporal'!$B$6:$L$103,7,FALSE),IF(F48=\"Poor\",VLOOKUP(D48,'10. Condition and Temporal'!$B$6:$L$103,8,FALSE),IF(F48=\"Condition Assessment N/A\",VLOOKUP(D48,'10. Condition and Temporal'!$B$6:$L$103,9,FALSE),IF(F48=\"N/A - Other\",VLOOKUP(D48,'10. Condition and Temporal'!$B$6:$L$103,10,FALSE)))))))","v":""},{"$f":"IF(AE48=\"\",\"\",VLOOKUP(AE48,'11. Lists'!$I$47:$K$80,3,FALSE))","v":""},{"$f":"IF(D48=\"\",\"\",VLOOKUP(D48,'9. All Habitats + Multipliers'!$C$4:$K$102,7,FALSE))","v":""},{"$f":"IF(AG48=\"\",\"\",VLOOKUP(AG48,'11. Lists'!$J$35:$K$38,2,FALSE))","v":""}]
[null,10,null,null,{"$f":"IF(D49=\"\",\"\",VLOOKUP(D49,'10. Condition and Temporal'!$B$6:$D$103,3,FALSE))","v":""},{"$nulls":6},"",{"$nulls":7},{"$f":"IF(C49=\"\",\"\",VLOOKUP(D49,'9. All Habitats + Multipliers'!$C$4:$K$102,5,FALSE))","v":""},null,{"$f":"IF(T49=\"\",\"\",VLOOKUP(T49,'11. Lists'!$B$47:$D$49,2,FALSE))","v":""},"",{"$f":"IF(W49=\"\",\"\",VLOOKUP(W49,'11. Lists'!$F$47:$G$51,2,FALSE))","v":""},{"$nulls":3},"",{"$f":"IF(AB49=\"\",\"\",VLOOKUP(AB49,'11. Lists'!$F$36:$H$38,2,FALSE))","v":""},{"$f":"IF(AB49=\"\",\"\",VLOOKUP(AB49,'11. Lists'!$F$36:$H$38,3,FALSE))","v":""},{"$f":"IF(F49=\"\",\"\",IF(F49=\"Moderate\",VLOOKUP(D49,'10. Condition and Temporal'!$B$6:$L$103,6,FALSE),IF(F49=\"Good\",VLOOKUP(D49,'10. Condition and Temporal'!$B$6:$L$103,7,FALSE),IF(F49=\"Poor\",VLOOKUP(D49,'10. Condition and Temporal'!$B$6:$L$103,8,FALSE),IF(F49=\"Condition Assessment N/A\",VLOOKUP(D49,'10. Condition and Temporal'!$B$6:$L$103,9,FALSE),IF(F49=\"N/A - Other\",VLOOKUP(D49,'10. Condition and Temporal'!$B$6:$L$103,10,FALSE)))))))","v":""},{"$f":"IF(AE49=\"\",\"\",VLOOKUP(AE49,'11. Lists'!$I$47:$K$80,3,FALSE))","v":""},{"$f":"IF(D49=\"\",\"\",VLOOKUP(D49,'9. All Habitats + Multipliers'!$C$4:$K$102,7,FALSE))","v":""},{"$f":"IF(AG49=\"\",\"\",VLOOKUP(AG49,'11. Lists'!$J$35:$K$38,2,FALSE))","v":""}]
[null,11,null,null,{"$f":"IF(D50=\"\",\"\",VLOOKUP(D50,'10. Condition and Temporal'!$B$6:$D$103,3,FALSE))","v":""},{"$nulls":6},"",{"$nulls":7},{"$f":"IF(C50=\"\",\"\",VLOOKUP(D50,'9. All Habitats + Multipliers'!$C$4:$K$102,5,FALSE))","v":""},null,{"$f":"IF(T50=\"\",\"\",VLOOKUP(T50,'11. Lists'!$B$47:$D$49,2,FALSE))","v":""},"",{"$f":"IF(W50=\"\",\"\",VLOOKUP(W50,'11. Lists'!$F$47:$G$51,2,FALSE))","v":""},{"$nulls":3},"",{"$f":"IF(AB50=\"\",\"\",VLOOKUP(AB50,'11. Lists'!$F$36:$H$38,2,FALSE))","v":""},{"$f":"IF(AB50=\"\",\"\",VLOOKUP(AB50,'11. Lists'!$F$36:$H$38,3,FALSE))","v":""},{"$f":"IF(F50=\"\",\"\",IF(F50=\"Moderate\",VLOOKUP(D50,'10. Condition and Temporal'!$B$6:$L$103,6,FALSE),IF(F50=\"Good\",VLOOKUP(D50,'10. Condition and Temporal'!$B$6:$L$103,7,FALSE),IF(F50=\"Poor\",VLOOKUP(D50,'10. Condition and Temporal'!$B$6:$L$103,8,FALSE),IF(F50=\"Condition Assessment N/A\",VLOOKUP(D50,'10. Condition and Temporal'!$B$6:$L$103,9,FALSE),IF(F50=\"N/A - Other\",VLOOKUP(D50,'10. Condition and Temporal'!$B$6:$L$103,10,FALSE)))))))","v":""},{"$f":"IF(AE50=\"\",\"\",VLOOKUP(AE50,'11. Lists'!$I$47:$K$80,3,FALSE))","v":""},{"$f":"IF(D50=\"\",\"\",VLOOKUP(D50,'9. All Habitats + Multipliers'!$C$4:$K$102,7,FALSE))","v":""},{"$f":"IF(AG50=\"\",\"\",VLOOKUP(AG50,'11. Lists'!$J$35:$K$38,2,FALSE))","v":""}]
[null,12,null,null,{"$f":"IF(D51=\"\",\"\",VLOOKUP(D51,'10. Condition and Temporal'!$B$6:$D$103,3,FALSE))","v":""},{"$nulls":6},"",{"$nulls":7},{"$f":"IF(C51=\"\",\"\",VLOOKUP(D51,'9. All Habitats + Multipliers'!$C$4:$K$102,5,FALSE))","v":""},null,{"$f":"IF(T51=\"\",\"\",VLOOKUP(T51,'11. Lists'!$B$47:$D$49,2,FALSE))","v":""},"",{"$f":"IF(W51=\"\",\"\",VLOOKUP(W51,'11. Lists'!$F$47:$G$51,2,FALSE))","v":""},{"$nulls":3},"",{"$f":"IF(AB51=\"\",\"\",VLOOKUP(AB51,'11. Lists'!$F$36:$H$38,2,FALSE))","v":""},{"$f":"IF(AB51=\"\",\"\",VLOOKUP(AB51,'11. Lists'!$F$36:$H$38,3,FALSE))","v":""},{"$f":"IF(F51=\"\",\"\",IF(F51=\"Moderate\",VLOOKUP(D51,'10. Condition and Temporal'!$B$6:$L$103,6,FALSE),IF(F51=\"Good\",VLOOKUP(D51,'10. Condition and Temporal'!$B$6:$L$103,7,FALSE),IF(F51=\"Poor\",VLOOKUP(D51,'10. Condition and Temporal'!$B$6:$L$103,8,FALSE),IF(F51=\"Condition Assessment N/A\",VLOOKUP(D51,'10. Condition and Temporal'!$B$6:$L$103,9,FALSE),IF(F51=\"N/A - Other\",VLOOKUP(D51,'10. Condition and Temporal'!$B$6:$L$103,10,FALSE)))))))","v":""},{"$f":"IF(AE51=\"\",\"\",VLOOKUP(AE51,'11. Lists'!$I$47:$K$80,3,FALSE))","v":""},{"$f":"IF(D51=\"\",\"\",VLOOKUP(D51,'9. All Habitats + Multipliers'!$C$4:$K$102,7,FALSE))","v":""},{"$f":"IF(AG51=\"\",\"\",VLOOKUP(AG51,'11. Lists'!$J$35:$K$38,2,FALSE))","v":""}]
[null,13,null,null,{"$f":"IF(D52=\"\",\"\",VLOOKUP(D52,'10. Condition and Temporal'!$B$6:$D$103,3,FALSE))","v":""},{"$nulls":6},"",{"$nulls":7},{"$f":"IF(C52=\"\",\"\",VLOOKUP(D52,'9. All Habitats + Multipliers'!$C$4:$K$102,5,FALSE))","v":""},null,{"$f":"IF(T52=\"\",\"\",VLOOKUP(T52,'11. Lists'!$B$47:$D$49,2,FALSE))","v":""},"",{"$f":"IF(W52=\"\",\"\",VLOOKUP(W52,'11. Lists'!$F$47:$G$51,2,FALSE))","v":""},{"$nulls":3},"",{"$f":"IF(AB52=\"\",\"\",VLOOKUP(AB52,'11. Lists'!$F$36:$H$38,2,FALSE))","v":""},{"$f":"IF(AB52=\"\",\"\",VLOOKUP(AB52,'11. Lists'!$F$36:$H$38,3,FALSE))","v":""},{"$f":"IF(F52=\"\",\"\",IF(F52=\"Moderate\",VLOOKUP(D52,'10. Condition and Temporal'!$B$6:$L$103,6,FALSE),IF(F52=\"Good\",VLOOKUP(D52,'10. Condition and Temporal'!$B$6:$L$103,7,FALSE),IF(F52=\"Poor\",VLOOKUP(D52,'10. Condition and Temporal'!$B$6:$L$103,8,FALSE),IF(F52=\"Condition Assessment N/A\",VLOOKUP(D52,'10. Condition and Temporal'!$B$6:$L$103,9,FALSE),IF(F52=\"N/A - Other\",VLOOKUP(D52,'10. Condition and Temporal'!$B$6:$L$103,10,FALSE)))))))","v":""},{"$f":"IF(AE52=\"\",\"\",VLOOKUP(AE52,'11. Lists'!$I$47:$K$80,3,FALSE))","v":""},{"$f":"IF(D52=\"\",\"\",VLOOKUP(D52,'9. All Habitats + Multipliers'!$C$4:$K$102,7,FALSE))","v":""},{"$f":"IF(AG52=\"\",\"\",VLOOKUP(AG52,'11. Lists'!$J$35:$K$38,2,FALSE))","v":""}]
[null,14,null,null,{"$f":"IF(D53=\"\",\"\",VLOOKUP(D53,'10. Condition and Temporal'!$B$6:$D$103,3,FALSE))","v":""},{"$nulls":6},"",{"$nulls":7},{"$f":"IF(C53=\"\",\"\",VLOOKUP(D53,'9. All Habitats + Multipliers'!$C$4:$K$102,5,FALSE))","v":""},null,{"$f":"IF(T53=\"\",\"\",VLOOKUP(T53,'11. Lists'!$B$47:$D$49,2,FALSE))","v":""},"",{"$f":"IF(W53=\"\",\"\",VLOOKUP(W53,'11. Lists'!$F$47:$G$51,2,FALSE))","v":""},{"$nulls":3},"",{"$f":"IF(AB53=\"\",\"\",VLOOKUP(AB53,'11. Lists'!$F$36:$H$38,2,FALSE))","v":""},{"$f":"IF(AB53=\"\",\"\",VLOOKUP(AB53,'11. Lists'!$F$36:$H$38,3,FALSE))","v":""},{"$f":"IF(F53=\"\",\"\",IF(F53=\"Moderate\",VLOOKUP(D53,'10. Condition and Temporal'!$B$6:$L$103,6,FALSE),IF(F53=\"Good\",VLOOKUP(D53,'10. Condition and Temporal'!$B$6:$L$103,7,FALSE),IF(F53=\"Poor\",VLOOKUP(D53,'10. Condition and Temporal'!$B$6:$L$103,8,FALSE),IF(F53=\"Condition Assessment N/A\",VLOOKUP(D53,'10. Condition and Temporal'!$B$6:$L$103,9,FALSE),IF(F53=\"N/A - Other\",VLOOKUP(D53,'10. Condition and Temporal'!$B$6:$L$103,10,FALSE)))))))","v":""},{"$f":"IF(AE53=\"\",\"\",VLOOKUP(AE53,'11. Lists'!$I$47:$K$80,3,FALSE))","v":""},{"$f":"IF(D53=\"\",\"\",VLOOKUP(D53,'9. All Habitats + Multipliers'!$C$4:$K$102,7,FALSE))","v":""},{"$f":"IF(AG53=\"\",\"\",VLOOKUP(AG53,'11. Lists'!$J$35:$K$38,2,FALSE))","v":""}]
[null,15,null,null,{"$f":"IF(D54=\"\",\"\",VLOOKUP(D54,'10. Condition and Temporal'!$B$6:$D$103,3,FALSE))","v":""},{"$nulls":6},"",{"$nulls":7},{"$f":"IF(C54=\"\",\"\",VLOOKUP(D54,'9. All Habitats + Multipliers'!$C$4:$K$102,5,FALSE))","v":""},null,{"$f":"IF(T54=\"\",\"\",VLOOKUP(T54,'11. Lists'!$B$47:$D$49,2,FALSE))","v":""},"",{"$f":"IF(W54=\"\",\"\",VLOOKUP(W54,'11. Lists'!$F$47:$G$51,2,FALSE))","v":""},{"$nulls":3},"",{"$f":"IF(AB54=\"\",\"\",VLOOKUP(AB54,'11. Lists'!$F$36:$H$38,2,FALSE))","v":""},{"$f":"IF(AB54=\"\",\"\",VLOOKUP(AB54,'11. Lists'!$F$36:$H$38,3,FALSE))","v":""},{"$f":"IF(F54=\"\",\"\",IF(F54=\"Moderate\",VLOOKUP(D54,'10. Condition and Temporal'!$B$6:$L$103,6,FALSE),IF(F54=\"Good\",VLOOKUP(D54,'10. Condition and Temporal'!$B$6:$L$103,7,FALSE),IF(F54=\"Poor\",VLOOKUP(D54,'10. Condition and Temporal'!$B$6:$L$103,8,FALSE),IF(F54=\"Condition Assessment N/A\",VLOOKUP(D54,'10. Condition and Temporal'!$B$6:$L$103,9,FALSE),IF(F54=\"N/A - Other\",VLOOKUP(D54,'10. Condition and Temporal'!$B$6:$L$103,10,FALSE)))))))","v":""},{"$f":"IF(AE54=\"\",\"\",VLOOKUP(AE54,'11. Lists'!$I$47:$K$80,3,FALSE))","v":""},{"$f":"IF(D54=\"\",\"\",VLOOKUP(D54,'9. All Habitats + Multipliers'!$C$4:$K$102,7,FALSE))","v":""},{"$f":"IF(AG54=\"\",\"\",VLOOKUP(AG54,'11. Lists'!$J$35:$K$38,2,FALSE))","v":""}]
[null,16,null,null,{"$f":"IF(D55=\"\",\"\",VLOOKUP(D55,'10. Condition and Temporal'!$B$6:$D$103,3,FALSE))","v":""},{"$nulls":6},"",{"$nulls":7},{"$f":"IF(C55=\"\",\"\",VLOOKUP(D55,'9. All Habitats + Multipliers'!$C$4:$K$102,5,FALSE))","v":""},null,{"$f":"IF(T55=\"\",\"\",VLOOKUP(T55,'11. Lists'!$B$47:$D$49,2,FALSE))","v":""},"",{"$f":"IF(W55=\"\",\"\",VLOOKUP(W55,'11. Lists'!$F$47:$G$51,2,FALSE))","v":""},{"$nulls":3},"",{"$f":"IF(AB55=\"\",\"\",VLOOKUP(AB55,'11. Lists'!$F$36:$H$38,2,FALSE))","v":""},{"$f":"IF(AB55=\"\",\"\",VLOOKUP(AB55,'11. Lists'!$F$36:$H$38,3,FALSE))","v":""},{"$f":"IF(F55=\"\",\"\",IF(F55=\"Moderate\",VLOOKUP(D55,'10. Condition and Temporal'!$B$6:$L$103,6,FALSE),IF(F55=\"Good\",VLOOKUP(D55,'10. Condition and Temporal'!$B$6:$L$103,7,FALSE),IF(F55=\"Poor\",VLOOKUP(D55,'10. Condition and Temporal'!$B$6:$L$103,8,FALSE),IF(F55=\"Condition Assessment N/A\",VLOOKUP(D55,'10. Condition and Temporal'!$B$6:$L$103,9,FALSE),IF(F55=\"N/A - Other\",VLOOKUP(D55,'10. Condition and Temporal'!$B$6:$L$103,10,FALSE)))))))","v":""},{"$f":"IF(AE55=\"\",\"\",VLOOKUP(AE55,'11. Lists'!$I$47:$K$80,3,FALSE))","v":""},{"$f":"IF(D55=\"\",\"\",VLOOKUP(D55,'9. All Habitats + Multipliers'!$C$4:$K$102,7,FALSE))","v":""},{"$f":"IF(AG55=\"\",\"\",VLOOKUP(AG55,'11. Lists'!$J$35:$K$38,2,FALSE))","v":""}]
[null,17,null,null,{"$f":"IF(D56=\"\",\"\",VLOOKUP(D56,'10. Condition and Temporal'!$B$6:$D$103,3,FALSE))","v":""},{"$nulls":6},"",{"$nulls":7},{"$f":"IF(C56=\"\",\"\",VLOOKUP(D56,'9. All Habitats + Multipliers'!$C$4:$K$102,5,FALSE))","v":""},null,{"$f":"IF(T56=\"\",\"\",VLOOKUP(T56,'11. Lists'!$B$47:$D$49,2,FALSE))","v":""},"",{"$f":"IF(W56=\"\",\"\",VLOOKUP(W56,'11. Lists'!$F$47:$G$51,2,FALSE))","v":""},{"$nulls":3},"",{"$f":"IF(AB56=\"\",\"\",VLOOKUP(AB56,'11. Lists'!$F$36:$H$38,2,FALSE))","v":""},{"$f":"IF(AB56=\"\",\"\",VLOOKUP(AB56,'11. Lists'!$F$36:$H$38,3,FALSE))","v":""},{"$f":"IF(F56=\"\",\"\",IF(F56=\"Moderate\",VLOOKUP(D56,'10. Condition and Temporal'!$B$6:$L$103,6,FALSE),IF(F56=\"Good\",VLOOKUP(D56,'10. Condition and Temporal'!$B$6:$L$103,7,FALSE),IF(F56=\"Poor\",VLOOKUP(D56,'10. Condition and Temporal'!$B$6:$L$103,8,FALSE),IF(F56=\"Condition Assessment N/A\",VLOOKUP(D56,'10. Condition and Temporal'!$B$6:$L$103,9,FALSE),IF(F56=\"N/A - Other\",VLOOKUP(D56,'10. Condition and Temporal'!$B$6:$L$103,10,FALSE)))))))","v":""},{"$f":"IF(AE56=\"\",\"\",VLOOKUP(AE56,'11. Lists'!$I$47:$K$80,3,FALSE))","v":""},{"$f":"IF(D56=\"\",\"\",VLOOKUP(D56,'9. All Habitats + Multipliers'!$C$4:$K$102,7,FALSE))","v":""},{"$f":"IF(AG56=\"\",\"\",VLOOKUP(AG56,'11. Lists'!$J$35:$K$38,2,FALSE))","v":""}]
[null,18,null,null,{"$f":"IF(D57=\"\",\"\",VLOOKUP(D57,'10. Condition and Temporal'!$B$6:$D$103,3,FALSE))","v":""},{"$nulls":6},"",{"$nulls":7},{"$f":"IF(C57=\"\",\"\",VLOOKUP(D57,'9. All Habitats + Multipliers'!$C$4:$K$102,5,FALSE))","v":""},null,{"$f":"IF(T57=\"\",\"\",VLOOKUP(T57,'11. Lists'!$B$47:$D$49,2,FALSE))","v":""},"",{"$f":"IF(W57=\"\",\"\",VLOOKUP(W57,'11. Lists'!$F$47:$G$51,2,FALSE))","v":""},{"$nulls":3},"",{"$f":"IF(AB57=\"\",\"\",VLOOKUP(AB57,'11. Lists'!$F$36:$H$38,2,FALSE))","v":""},{"$f":"IF(AB57=\"\",\"\",VLOOKUP(AB57,'11. Lists'!$F$36:$H$38,3,FALSE))","v":""},{"$f":"IF(F57=\"\",\"\",IF(F57=\"Moderate\",VLOOKUP(D57,'10. Condition and Temporal'!$B$6:$L$103,6,FALSE),IF(F57=\"Good\",VLOOKUP(D57,'10. Condition and Temporal'!$B$6:$L$103,7,FALSE),IF(F57=\"Poor\",VLOOKUP(D57,'10. Condition and Temporal'!$B$6:$L$103,8,FALSE),IF(F57=\"Condition Assessment N/A\",VLOOKUP(D57,'10. Condition and Temporal'!$B$6:$L$103,9,FALSE),IF(F57=\"N/A - Other\",VLOOKUP(D57,'10. Condition and Temporal'!$B$6:$L$103,10,FALSE)))))))","v":""},{"$f":"IF(AE57=\"\",\"\",VLOOKUP(AE57,'11. Lists'!$I$47:$K$80,3,FALSE))","v":""},{"$f":"IF(D57=\"\",\"\",VLOOKUP(D57,'9. All Habitats + Multipliers'!$C$4:$K$102,7,FALSE))","v":""},{"$f":"IF(AG57=\"\",\"\",VLOOKUP(AG57,'11. Lists'!$J$35:$K$38,2,FALSE))","v":""}]
[null,19,null,null,{"$f":"IF(D58=\"\",\"\",VLOOKUP(D58,'10. Condition and Temporal'!$B$6:$D$103,3,FALSE))","v":""},{"$nulls":6},"",{"$nulls":7},{"$f":"IF(C58=\"\",\"\",VLOOKUP(D58,'9. All Habitats + Multipliers'!$C$4:$K$102,5,FALSE))","v":""},null,{"$f":"IF(T58=\"\",\"\",VLOOKUP(T58,'11. Lists'!$B$47:$D$49,2,FALSE))","v":""},"",{"$f":"IF(W58=\"\",\"\",VLOOKUP(W58,'11. Lists'!$F$47:$G$51,2,FALSE))","v":""},{"$nulls":3},"",{"$f":"IF(AB58=\"\",\"\",VLOOKUP(AB58,'11. Lists'!$F$36:$H$38,2,FALSE))","v":""},{"$f":"IF(AB58=\"\",\"\",VLOOKUP(AB58,'11. Lists'!$F$36:$H$38,3,FALSE))","v":""},{"$f":"IF(F58=\"\",\"\",IF(F58=\"Moderate\",VLOOKUP(D58,'10. Condition and Temporal'!$B$6:$L$103,6,FALSE),IF(F58=\"Good\",VLOOKUP(D58,'10. Condition and Temporal'!$B$6:$L$103,7,FALSE),IF(F58=\"Poor\",VLOOKUP(D58,'10. Condition and Temporal'!$B$6:$L$103,8,FALSE),IF(F58=\"Condition Assessment N/A\",VLOOKUP(D58,'10. Condition and Temporal'!$B$6:$L$103,9,FALSE),IF(F58=\"N/A - Other\",VLOOKUP(D58,'10. Condition and Temporal'!$B$6:$L$103,10,FALSE)))))))","v":""},{"$f":"IF(AE58=\"\",\"\",VLOOKUP(AE58,'11. Lists'!$I$47:$K$80,3,FALSE))","v":""},{"$f":"IF(D58=\"\",\"\",VLOOKUP(D58,'9. All Habitats + Multipliers'!$C$4:$K$102,7,FALSE))","v":""},{"$f":"IF(AG58=\"\",\"\",VLOOKUP(AG58,'11. Lists'!$J$35:$K$38,2,FALSE))","v":""}]
[null,20,null,null,{"$f":"IF(D59=\"\",\"\",VLOOKUP(D59,'10. Condition and Temporal'!$B$6:$D$103,3,FALSE))","v":""},{"$nulls":6},"",{"$nulls":7},{"$f":"IF(C59=\"\",\"\",VLOOKUP(D59,'9. All Habitats + Multipliers'!$C$4:$K$102,5,FALSE))","v":""},null,{"$f":"IF(T59=\"\",\"\",VLOOKUP(T59,'11. Lists'!$B$47:$D$49,2,FALSE))","v":""},"",{"$f":"IF(W59=\"\",\"\",VLOOKUP(W59,'11. Lists'!$F$47:$G$51,2,FALSE))","v":""},{"$nulls":3},"",{"$f":"IF(AB59=\"\",\"\",VLOOKUP(AB59,'11. Lists'!$F$36:$H$38,2,FALSE))","v":""},{"$f":"IF(AB59=\"\",\"\",VLOOKUP(AB59,'11. Lists'!$F$36:$H$38,3,FALSE))","v":""},{"$f":"IF(F59=\"\",\"\",IF(F59=\"Moderate\",VLOOKUP(D59,'10. Condition and Temporal'!$B$6:$L$103,6,FALSE),IF(F59=\"Good\",VLOOKUP(D59,'10. Condition and Temporal'!$B$6:$L$103,7,FALSE),IF(F59=\"Poor\",VLOOKUP(D59,'10. Condition and Temporal'!$B$6:$L$103,8,FALSE),IF(F59=\"Condition Assessment N/A\",VLOOKUP(D59,'10. Condition and Temporal'!$B$6:$L$103,9,FALSE),IF(F59=\"N/A - Other\",VLOOKUP(D59,'10. Condition and Temporal'!$B$6:$L$103,10,FALSE)))))))","v":""},{"$f":"IF(AE59=\"\",\"\",VLOOKUP(AE59,'11. Lists'!$I$47:$K$80,3,FALSE))","v":""},{"$f":"IF(D59=\"\",\"\",VLOOKUP(D59,'9. All Habitats + Multipliers'!$C$4:$K$102,7,FALSE))","v":""},{"$f":"IF(AG59=\"\",\"\",VLOOKUP(AG59,'11. Lists'!$J$35:$K$38,2,FALSE))","v":""}]
[null,"Trees","Individual trees","Urban/rural tree","Moderate","Moderate",null,"Area/compensation not in local strategy/ no local strategy",{"$f":"O99","v":{"v":122.08319999999998,"d":"122.08"}},null,null,{"$f":"IF(D60=\"\",\"\",((I60/10000)*(V60*X60))*(AH60*AF60)*AD60)","v":{"v":0.037323584979595766,"d":"0.0373"}},{"$nulls":7},{"$f":"IF(C60=\"\",\"\",VLOOKUP(D60,'9. All Habitats + Multipliers'!$C$4:$K$102,5,FALSE))","v":"Medium"},null,{"$f":"IF(T60=\"\",\"\",VLOOKUP(T60,'11. Lists'!$B$47:$D$49,2,FALSE))","v":4},{"$f":"IF(F60=\"\",\"\",F60)","v":"Moderate"},{"$f":"IF(W60=\"\",\"\",VLOOKUP(W60,'11. Lists'!$F$47:$G$51,2,FALSE))","v":2},{"$nulls":3},"Area/compensation not in local strategy/ no local strategy",{"$f":"IF(AB60=\"\",\"\",VLOOKUP(AB60,'11. Lists'!$F$36:$H$38,2,FALSE))","v":"Low Strategic Significance"},{"$f":"IF(AB60=\"\",\"\",VLOOKUP(AB60,'11. Lists'!$F$36:$H$38,3,FALSE))","v":1},{"$f":"IF(F60=\"\",\"\",IF(F60=\"Moderate\",VLOOKUP(D60,'10. Condition and Temporal'!$B$6:$L$103,6,FALSE),IF('5. Area Habitats'!F60=\"Good\",VLOOKUP(D60,'10. Condition and Temporal'!$B$6:$L$103,7,FALSE),VLOOKUP(D60,'10. Condition and Temporal'!$B$6:$L$103,8,FALSE))))","v":27},{"$f":"IF(AE60=\"\",\"\",VLOOKUP(AE60,'11. Lists'!$I$47:$K$80,3,FALSE))","v":{"v":0.3821531646,"d":"0.382"}},{"$f":"IF(D60=\"\",\"\",VLOOKUP(D60,'9. All Habitats + Multipliers'!$C$4:$K$102,7,FALSE))","v":"Low"},{"$f":"IF(AG60=\"\",\"\",VLOOKUP(AG60,'11. Lists'!$J$35:$K$38,2,FALSE))","v":1}]
[{"$nulls":7},"Totals (areas excl trees, green walls and intertidal hard structures)",{"$f":"SUMIFS(I40:I59,D40:D59,\"<>\"&'11. Lists'!Q10,D40:D59,\"<>\"&'11. Lists'!Q11,D40:D59,\"<>\"&'11. Lists'!I4,D40:D59,\"<>\"&'11. Lists'!I2,D40:D59,\"<>\"&'11. Lists'!I3)","v":{"v":270,"d":"270.00"}},null,null,{"$f":"SUM(L40:N60)","v":{"v":0.05469358497959577,"d":"0.0547"}}]
[{"$nulls":7},"Error Check 4",{"$f":"IF(AND(M32=0,I61=0),\"Areas Acceptable ✓\",IF(OR(I61-M32<=-0.001,(I61-M32>=0.001)),(\"Error - Area of habitat creation must match area lost ▲\"),(\"Areas Acceptable ✓\")))","v":"Areas Acceptable ✓"},{"$nulls":5},{"$f":"IFERROR(FIND(\"Error\",I62),0)","v":0}]
[{"$nulls":8},{"$f":"SUM($I$40:$K$60)","v":{"v":392.0832,"d":"392.08"}},{"$nulls":43},"Divider"]
[null,"1c. Habitats to be enhanced",{"$nulls":50},","]
[{"$nulls":17},"Data beyond this column is automated"]
[null,"Baseline ref","Existing Habitat Type",null,"Enhanced Habitat type",null,null,"B. Strategic significance","Area Enhanced","Enhanced Condition",null,"Total Units","Net Improvement",null,"Comments",{"$nulls":4},"Baseline Values",{"$nulls":10}," Distinctiveness change acceptable?","Enhanced multipliers",{"$nulls":10},"Condition enhancement - Time to target condition/years","Enhanced multipliers",{"$nulls":8},"Number of options",{"$f":"COUNTIF(BB68:BB87,\"?*\")","v":0},{"$f":"COUNTIF(BC68:BC87,\"?*\")","v":0},0,0,0,0,0,0,0,0,0,0,0,0,0,0,0,0,0,0]
[null,null,"Broad habitat type","Existing habitat type","Enhancement Type","A. Enhanced habitat type",{"$nulls":8},"User comments","LPA comments",{"$nulls":3},"Area enhanced","Baseline distinctiveness band","Baseline distinctiveness score","Baseline condition category","Baseline condition score",{"$nulls":3},"Baseline strategic significance category","Baseline strategic significance score","Baseline value of area enhanced",null,"Area enhanced","Distinctiveness","Score","Condition ","Score",{"$nulls":3},"Strategic significance","Strategic significance","Strategic significance multiplier",null,"Condition enhancement - Time to target multiplier","Distinctiveness enhancement - Time to target condition/years","Distinctiveness enhancement - Time to target multiplier","Difficulty of enhancement category","Difficulty of enhancement multiplier","Acceptable habitat types","Enhancement type","Enhancement broad habitat type",null,"Option number",1,2,3,4,5,6,7,8,9,10,11,12,13,14,15,16,17,18,19,20,"List range","Column ref","list  length"]
[null,1,{"$f":"IF(D68=\"\",\"\",C11)","v":""},{"$f":"IF(OR(K11=0, K11=\"\"),\"\",D11)","v":""},{"$f":"IF(AX68=\"\",\"\",AX68)","v":""},null,null,{"$f":"IF(D68=\"\",\"\",AB68)","v":""},{"$f":"IF(OR(K11=\"\", K11=0),\"\",K11)","v":""},{"$f":"IFERROR(IF(F68=\"\",\"\",VLOOKUP(F68,'10. Condition and Temporal'!$B$6:$F$103,5,FALSE)), \"Error ▲\")","v":""},null,{"$f":"IFERROR(IF(D68=\"\",\"\",IF(AX68=\"Distinctiveness\",(((((I68*AH68*AJ68)-(I68*V68*X68))*(AV68*AT68))+(I68*V68*X68))*(AP68))/10000,((((I68*AJ68*AH68)-(I68*V68*X68))*(AV68*AR68))+(I68*V68*X68))*AP68/10000)),\"Error ▲\")","v":""},{"$f":"IFERROR(IF(F68=\"\",\"\",L68-AD68), \"Error ▲\")","v":""},{"$nulls":6},{"$f":"IF(D68=\"\",\"\",K11)","v":""},{"$f":"IF($D68=\"\",\"\",T11)","v":""},{"$f":"IF($D68=\"\",\"\",V11)","v":""},"","",{"$nulls":3},{"$f":"IF($D68=\"\",\"\",AB11)","v":""},{"$f":"IF($D68=\"\",\"\",AD11)","v":""},{"$f":"IF(AC68=\"\",\"\",(T68*V68*X68)*AC68/10000)","v":""},{"$f":"IF(AD68=\"\",\"\",IF(AH68<V68,\"Not Acceptable\",\"Acceptable\"))","v":""},{"$f":"IF(D68=\"\",\"\",I68)","v":""},{"$f":"IF(D68=\"\",\"\",VLOOKUP(F68,'9. All Habitats + Multipliers'!$C$4:$K$102,5,FALSE))","v":""},{"$f":"IF(AG68=\"\",\"\",VLOOKUP(AG68,'11. Lists'!$B$47:$D$49,2,FALSE))","v":""},{"$f":"IF(D68=\"\",\"\",J68)","v":""},{"$f":"IF(AI68=\"\",\"\",VLOOKUP(AI68,'11. Lists'!$F$47:$G$51,2,FALSE))","v":""},{"$nulls":3},{"$f":"IF(H68=\"\",\"\",H68)","v":""},{"$f":"IF(AN68=\"\",\"\",VLOOKUP(AN68,'11. Lists'!$F$36:$H$38,2,FALSE))","v":""},{"$f":"IF(AN68=\"\",\"\",VLOOKUP(AN68,'11. Lists'!$F$36:$H$38,3,FALSE))","v":""},{"$f":"IF(D68=\"\",\"\",IF(AX68=\"Distinctiveness\",\"N/A\",VLOOKUP(F68,'10. Condition and Temporal'!$B$6:$L$103,11,FALSE)))","v":""},{"$f":"IF(AQ68=\"\",\"\",IF(AQ68=\"N/A\",\"1\",VLOOKUP(AQ68,'11. Lists'!$I$47:$K$80,3,FALSE)))","v":""},{"$f":"IF(D68=\"\",\"\",IF(AX68=\"Condition\",\"N/A\",VLOOKUP(F68,'10. Condition and Temporal'!$B$6:$M$106,12,FALSE)))","v":""},{"$f":"IF(AS68=\"\",\"\",IF(AS68=\"N/A\",\"1\",VLOOKUP(AS68,'11. Lists'!$I$47:$K$80,3,FALSE)))","v":""},{"$f":"IF(D68=\"\",\"\",VLOOKUP(F68,'9. All Habitats + Multipliers'!$C$4:$K$102,8,FALSE))","v":""},{"$f":"IF(AU68=\"\",\"\",VLOOKUP(AU68,'11. Lists'!$J$35:$K$38,2,FALSE))","v":""},{"$f":"IF(D68=\"\",\"\",VLOOKUP(D68,'10. Condition and Temporal'!$B$6:$M$103,4,FALSE))","v":""},{"$f":"IF(F68=\"\",\"\",IF(D68=F68,\"Condition\",\"Distinctiveness\"))","v":""},{"$f":"IF(COUNTIF(F68,\"*grassland*\"),\"Grassland\",IF(COUNTIF(F68,\"*scree*\"),\"Sparsely vegetated land\",C68))","v":""},null,1,{"$f":"TRIM(MID(SUBSTITUTE($AW$68,$BA$64,REPT(\" \",LEN($AW$68))),($BA68-1)*LEN($AW$68)+1,LEN($AW$68)))","v":""},{"$f":"TRIM(MID(SUBSTITUTE($AW$69,$BA$64,REPT(\" \",LEN($AW$69))),($BA68-1)*LEN($AW$69)+1,LEN($AW$69)))","v":""},{"$f":"TRIM(MID(SUBSTITUTE($AW$70,$BA$64,REPT(\" \",LEN($AW$70))),($BA68-1)*LEN($AW$70)+1,LEN($AW$70)))","v":""},{"$f":"TRIM(MID(SUBSTITUTE($AW$71,$BA$64,REPT(\" \",LEN($AW$71))),($BA68-1)*LEN($AW$71)+1,LEN($AW$71)))","v":""},{"$f":"TRIM(MID(SUBSTITUTE($AW$72,$BA$64,REPT(\" \",LEN($AW$72))),($BA68-1)*LEN($AW$72)+1,LEN($AW$72)))","v":""},{"$f":"TRIM(MID(SUBSTITUTE($AW$73,$BA$64,REPT(\" \",LEN($AW$73))),($BA68-1)*LEN($AW$73)+1,LEN($AW$73)))","v":""},{"$f":"TRIM(MID(SUBSTITUTE($AW$74,$BA$64,REPT(\" \",LEN($AW$74))),($BA68-1)*LEN($AW$74)+1,LEN($AW$74)))","v":""},{"$f":"TRIM(MID(SUBSTITUTE($AW$75,$BA$64,REPT(\" \",LEN($AW$75))),($BA68-1)*LEN($AW$75)+1,LEN($AW$75)))","v":""},{"$f":"TRIM(MID(SUBSTITUTE($AW$76,$BA$64,REPT(\" \",LEN($AW$76))),($BA68-1)*LEN($AW$76)+1,LEN($AW$76)))","v":""},{"$f":"TRIM(MID(SUBSTITUTE($AW$77,$BA$64,REPT(\" \",LEN($AW$77))),($BA68-1)*LEN($AW$77)+1,LEN($AW$77)))","v":""},{"$f":"TRIM(MID(SUBSTITUTE($AW$78,$BA$64,REPT(\" \",LEN($AW$78))),($BA68-1)*LEN($AW$78)+1,LEN($AW$78)))","v":""},{"$f":"TRIM(MID(SUBSTITUTE($AW$79,$BA$64,REPT(\" \",LEN($AW$79))),($BA68-1)*LEN($AW$79)+1,LEN($AW$79)))","v":""},{"$f":"TRIM(MID(SUBSTITUTE($AW$80,$BA$64,REPT(\" \",LEN($AW$80))),($BA68-1)*LEN($AW$80)+1,LEN($AW$80)))","v":""},{"$f":"TRIM(MID(SUBSTITUTE($AW$81,$BA$64,REPT(\" \",LEN($AW$81))),($BA68-1)*LEN($AW$81)+1,LEN($AW$81)))","v":""},{"$f":"TRIM(MID(SUBSTITUTE($AW$82,$BA$64,REPT(\" \",LEN($AW$82))),($BA68-1)*LEN($AW$82)+1,LEN($AW$82)))","v":""},{"$f":"TRIM(MID(SUBSTITUTE($AW$83,$BA$64,REPT(\" \",LEN($AW$83))),($BA68-1)*LEN($AW$83)+1,LEN($AW$83)))","v":""},{"$f":"TRIM(MID(SUBSTITUTE($AW$84,$BA$64,REPT(\" \",LEN($AW$84))),($BA68-1)*LEN($AW$84)+1,LEN($AW$84)))","v":""},{"$f":"TRIM(MID(SUBSTITUTE($AW$85,$BA$64,REPT(\" \",LEN($AW$85))),($BA68-1)*LEN($AW$85)+1,LEN($AW$85)))","v":""},{"$f":"TRIM(MID(SUBSTITUTE($AW$86,$BA$64,REPT(\" \",LEN($AW$86))),($BA68-1)*LEN($AW$86)+1,LEN($AW$86)))","v":""},{"$f":"TRIM(MID(SUBSTITUTE($AW$87,$BA$64,REPT(\" \",LEN($AW$87))),($BA68-1)*LEN($AW$87)+1,LEN($AW$87)))","v":""},{"$f":"IF(BX68=0,\"\",CONCATENATE(BW68,\"68:\",BW68,BX68+67))","v":""},"BB",{"$f":"BB66","v":0}]
[null,2,"",{"$f":"IF(OR(K12=0, K12=\"\"),\"\",D12)","v":""},"",null,null,"",{"$f":"IF(OR(K12=\"\", K12=0),\"\",K12)","v":""},{"$f":"IFERROR(IF(F69=\"\",\"\",VLOOKUP(F69,'10. Condition and Temporal'!$B$6:$F$103,5,FALSE)), \"Error ▲\")","v":""},null,{"$f":"IFERROR(IF(D69=\"\",\"\",IF(AX69=\"Distinctiveness\",(((((I69*AH69*AJ69)-(I69*V69*X69))*(AV69*AT69))+(I69*V69*X69))*(AP69))/10000,((((I69*AJ69*AH69)-(I69*V69*X69))*(AV69*AR69))+(I69*V69*X69))*AP69/10000)),\"Error ▲\")","v":""},{"$f":"IFERROR(IF(F69=\"\",\"\",L69-AD69), \"Error ▲\")","v":""},{"$nulls":6},"",{"$f":"IF($D69=\"\",\"\",T12)","v":""},"","","",{"$nulls":3},"","",{"$f":"IF(AC69=\"\",\"\",(T69*V69*X69)*AC69/10000)","v":""},{"$f":"IF(AD69=\"\",\"\",IF(AH69<V69,\"Not Acceptable\",\"Acceptable\"))","v":""},"",{"$f":"IF(D69=\"\",\"\",VLOOKUP(F69,'9. All Habitats + Multipliers'!$C$4:$K$102,5,FALSE))","v":""},{"$f":"IF(AG69=\"\",\"\",VLOOKUP(AG69,'11. Lists'!$B$47:$D$49,2,FALSE))","v":""},"",{"$f":"IF(AI69=\"\",\"\",VLOOKUP(AI69,'11. Lists'!$F$47:$G$51,2,FALSE))","v":""},{"$nulls":3},"",{"$f":"IF(AN69=\"\",\"\",VLOOKUP(AN69,'11. Lists'!$F$36:$H$38,2,FALSE))","v":""},{"$f":"IF(AN69=\"\",\"\",VLOOKUP(AN69,'11. Lists'!$F$36:$H$38,3,FALSE))","v":""},{"$f":"IF(D69=\"\",\"\",IF(AX69=\"Distinctiveness\",\"N/A\",VLOOKUP(F69,'10. Condition and Temporal'!$B$6:$L$103,11,FALSE)))","v":""},{"$f":"IF(AQ69=\"\",\"\",IF(AQ69=\"N/A\",\"1\",VLOOKUP(AQ69,'11. Lists'!$I$47:$K$80,3,FALSE)))","v":""},{"$f":"IF(D69=\"\",\"\",IF(AX69=\"Condition\",\"N/A\",VLOOKUP(F69,'10. Condition and Temporal'!$B$6:$M$106,12,FALSE)))","v":""},{"$f":"IF(AS69=\"\",\"\",IF(AS69=\"N/A\",\"1\",VLOOKUP(AS69,'11. Lists'!$I$47:$K$80,3,FALSE)))","v":""},{"$f":"IF(D69=\"\",\"\",VLOOKUP(F69,'9. All Habitats + Multipliers'!$C$4:$K$102,8,FALSE))","v":""},{"$f":"IF(AU69=\"\",\"\",VLOOKUP(AU69,'11. Lists'!$J$35:$K$38,2,FALSE))","v":""},{"$f":"IF(D69=\"\",\"\",VLOOKUP(D69,'10. Condition and Temporal'!$B$6:$M$103,4,FALSE))","v":""},"",{"$f":"IF(COUNTIF(F69,\"*grassland*\"),\"Grassland\",IF(COUNTIF(F69,\"*scree*\"),\"Sparsely vegetated land\",C69))","v":""},null,2,"","","","","","","","","","","","","","","","","","","","",{"$f":"IF(BX69=0,\"\",CONCATENATE(BW69,\"68:\",BW69,BX69+67))","v":""},"BC",{"$f":"BC66","v":0}]
[null,3,"","","",null,null,"","",{"$f":"IFERROR(IF(F70=\"\",\"\",VLOOKUP(F70,'10. Condition and Temporal'!$B$6:$F$103,5,FALSE)), \"Error ▲\")","v":""},null,"","",{"$nulls":6},"","","","","",{"$nulls":3},"","",{"$f":"IF(AC70=\"\",\"\",(T70*V70*X70)*AC70/10000)","v":""},"","",{"$f":"IF(D70=\"\",\"\",VLOOKUP(F70,'9. All Habitats + Multipliers'!$C$4:$K$102,5,FALSE))","v":""},{"$f":"IF(AG70=\"\",\"\",VLOOKUP(AG70,'11. Lists'!$B$47:$D$49,2,FALSE))","v":""},"",{"$f":"IF(AI70=\"\",\"\",VLOOKUP(AI70,'11. Lists'!$F$47:$G$51,2,FALSE))","v":""},{"$nulls":3},"",{"$f":"IF(AN70=\"\",\"\",VLOOKUP(AN70,'11. Lists'!$F$36:$H$38,2,FALSE))","v":""},{"$f":"IF(AN70=\"\",\"\",VLOOKUP(AN70,'11. Lists'!$F$36:$H$38,3,FALSE))","v":""},{"$f":"IF(D70=\"\",\"\",IF(AX70=\"Distinctiveness\",\"N/A\",VLOOKUP(F70,'10. Condition and Temporal'!$B$6:$L$103,11,FALSE)))","v":""},{"$f":"IF(AQ70=\"\",\"\",IF(AQ70=\"N/A\",\"1\",VLOOKUP(AQ70,'11. Lists'!$I$47:$K$80,3,FALSE)))","v":""},{"$f":"IF(D70=\"\",\"\",IF(AX70=\"Condition\",\"N/A\",VLOOKUP(F70,'10. Condition and Temporal'!$B$6:$M$106,12,FALSE)))","v":""},{"$f":"IF(AS70=\"\",\"\",IF(AS70=\"N/A\",\"1\",VLOOKUP(AS70,'11. Lists'!$I$47:$K$80,3,FALSE)))","v":""},{"$f":"IF(D70=\"\",\"\",VLOOKUP(F70,'9. All Habitats + Multipliers'!$C$4:$K$102,8,FALSE))","v":""},{"$f":"IF(AU70=\"\",\"\",VLOOKUP(AU70,'11. Lists'!$J$35:$K$38,2,FALSE))","v":""},{"$f":"IF(D70=\"\",\"\",VLOOKUP(D70,'10. Condition and Temporal'!$B$6:$M$103,4,FALSE))","v":""},"","",null,3,"","","","","","","","","","","","","","","","","","","","","","BD",{"$f":"BD66","v":0}]
[null,4,"","","",null,null,"","",{"$f":"IFERROR(IF(F71=\"\",\"\",VLOOKUP(F71,'10. Condition and Temporal'!$B$6:$F$103,5,FALSE)), \"Error ▲\")","v":""},null,"","",{"$nulls":6},"","","","","",{"$nulls":3},"","","","","",{"$f":"IF(D71=\"\",\"\",VLOOKUP(F71,'9. All Habitats + Multipliers'!$C$4:$K$102,5,FALSE))","v":""},{"$f":"IF(AG71=\"\",\"\",VLOOKUP(AG71,'11. Lists'!$B$47:$D$49,2,FALSE))","v":""},"",{"$f":"IF(AI71=\"\",\"\",VLOOKUP(AI71,'11. Lists'!$F$47:$G$51,2,FALSE))","v":""},{"$nulls":3},"",{"$f":"IF(AN71=\"\",\"\",VLOOKUP(AN71,'11. Lists'!$F$36:$H$38,2,FALSE))","v":""},{"$f":"IF(AN71=\"\",\"\",VLOOKUP(AN71,'11. Lists'!$F$36:$H$38,3,FALSE))","v":""},{"$f":"IF(D71=\"\",\"\",IF(AX71=\"Distinctiveness\",\"N/A\",VLOOKUP(F71,'10. Condition and Temporal'!$B$6:$L$103,11,FALSE)))","v":""},{"$f":"IF(AQ71=\"\",\"\",IF(AQ71=\"N/A\",\"1\",VLOOKUP(AQ71,'11. Lists'!$I$47:$K$80,3,FALSE)))","v":""},{"$f":"IF(D71=\"\",\"\",IF(AX71=\"Condition\",\"N/A\",VLOOKUP(F71,'10. Condition and Temporal'!$B$6:$M$106,12,FALSE)))","v":""},{"$f":"IF(AS71=\"\",\"\",IF(AS71=\"N/A\",\"1\",VLOOKUP(AS71,'11. Lists'!$I$47:$K$80,3,FALSE)))","v":""},{"$f":"IF(D71=\"\",\"\",VLOOKUP(F71,'9. All Habitats + Multipliers'!$C$4:$K$102,8,FALSE))","v":""},{"$f":"IF(AU71=\"\",\"\",VLOOKUP(AU71,'11. Lists'!$J$35:$K$38,2,FALSE))","v":""},{"$f":"IF(D71=\"\",\"\",VLOOKUP(D71,'10. Condition and Temporal'!$B$6:$M$103,4,FALSE))","v":""},"","",null,4,"","","","","","","","","","","","","","","","","","","","","","BE",{"$f":"BE66","v":0}]
[null,5,"","","",null,null,"","",{"$f":"IFERROR(IF(F72=\"\",\"\",VLOOKUP(F72,'10. Condition and Temporal'!$B$6:$F$103,5,FALSE)), \"Error ▲\")","v":""},null,"","",{"$nulls":6},"","","","","",{"$nulls":3},"","","","","",{"$f":"IF(D72=\"\",\"\",VLOOKUP(F72,'9. All Habitats + Multipliers'!$C$4:$K$102,5,FALSE))","v":""},{"$f":"IF(AG72=\"\",\"\",VLOOKUP(AG72,'11. Lists'!$B$47:$D$49,2,FALSE))","v":""},"",{"$f":"IF(AI72=\"\",\"\",VLOOKUP(AI72,'11. Lists'!$F$47:$G$51,2,FALSE))","v":""},{"$nulls":3},"",{"$f":"IF(AN72=\"\",\"\",VLOOKUP(AN72,'11. Lists'!$F$36:$H$38,2,FALSE))","v":""},{"$f":"IF(AN72=\"\",\"\",VLOOKUP(AN72,'11. Lists'!$F$36:$H$38,3,FALSE))","v":""},{"$f":"IF(D72=\"\",\"\",IF(AX72=\"Distinctiveness\",\"N/A\",VLOOKUP(F72,'10. Condition and Temporal'!$B$6:$L$103,11,FALSE)))","v":""},{"$f":"IF(AQ72=\"\",\"\",IF(AQ72=\"N/A\",\"1\",VLOOKUP(AQ72,'11. Lists'!$I$47:$K$80,3,FALSE)))","v":""},{"$f":"IF(D72=\"\",\"\",IF(AX72=\"Condition\",\"N/A\",VLOOKUP(F72,'10. Condition and Temporal'!$B$6:$M$106,12,FALSE)))","v":""},{"$f":"IF(AS72=\"\",\"\",IF(AS72=\"N/A\",\"1\",VLOOKUP(AS72,'11. Lists'!$I$47:$K$80,3,FALSE)))","v":""},{"$f":"IF(D72=\"\",\"\",VLOOKUP(F72,'9. All Habitats + Multipliers'!$C$4:$K$102,8,FALSE))","v":""},{"$f":"IF(AU72=\"\",\"\",VLOOKUP(AU72,'11. Lists'!$J$35:$K$38,2,FALSE))","v":""},{"$f":"IF(D72=\"\",\"\",VLOOKUP(D72,'10. Condition and Temporal'!$B$6:$M$103,4,FALSE))","v":""},"","",null,5,"","","","","","","","","","","","","","","","","","","","","","BF",{"$f":"BF66","v":0}]
[null,6,"","","",null,null,"","",{"$f":"IFERROR(IF(F73=\"\",\"\",VLOOKUP(F73,'10. Condition and Temporal'!$B$6:$F$103,5,FALSE)), \"Error ▲\")","v":""},null,"","",{"$nulls":6},"","","","","",{"$nulls":3},"","","","","",{"$f":"IF(D73=\"\",\"\",VLOOKUP(F73,'9. All Habitats + Multipliers'!$C$4:$K$102,5,FALSE))","v":""},{"$f":"IF(AG73=\"\",\"\",VLOOKUP(AG73,'11. Lists'!$B$47:$D$49,2,FALSE))","v":""},"",{"$f":"IF(AI73=\"\",\"\",VLOOKUP(AI73,'11. Lists'!$F$47:$G$51,2,FALSE))","v":""},{"$nulls":3},"",{"$f":"IF(AN73=\"\",\"\",VLOOKUP(AN73,'11. Lists'!$F$36:$H$38,2,FALSE))","v":""},{"$f":"IF(AN73=\"\",\"\",VLOOKUP(AN73,'11. Lists'!$F$36:$H$38,3,FALSE))","v":""},{"$f":"IF(D73=\"\",\"\",IF(AX73=\"Distinctiveness\",\"N/A\",VLOOKUP(F73,'10. Condition and Temporal'!$B$6:$L$103,11,FALSE)))","v":""},{"$f":"IF(AQ73=\"\",\"\",IF(AQ73=\"N/A\",\"1\",VLOOKUP(AQ73,'11. Lists'!$I$47:$K$80,3,FALSE)))","v":""},{"$f":"IF(D73=\"\",\"\",IF(AX73=\"Condition\",\"N/A\",VLOOKUP(F73,'10. Condition and Temporal'!$B$6:$M$106,12,FALSE)))","v":""},{"$f":"IF(AS73=\"\",\"\",IF(AS73=\"N/A\",\"1\",VLOOKUP(AS73,'11. Lists'!$I$47:$K$80,3,FALSE)))","v":""},{"$f":"IF(D73=\"\",\"\",VLOOKUP(F73,'9. All Habitats + Multipliers'!$C$4:$K$102,8,FALSE))","v":""},{"$f":"IF(AU73=\"\",\"\",VLOOKUP(AU73,'11. Lists'!$J$35:$K$38,2,FALSE))","v":""},{"$f":"IF(D73=\"\",\"\",VLOOKUP(D73,'10. Condition and Temporal'!$B$6:$M$103,4,FALSE))","v":""},"","",null,6,"","","","","","","","","","","","","","","","","","","","","","BG",{"$f":"BG66","v":0}]
[null,7,"","","",null,null,"","",{"$f":"IFERROR(IF(F74=\"\",\"\",VLOOKUP(F74,'10. Condition and Temporal'!$B$6:$F$103,5,FALSE)), \"Error ▲\")","v":""},null,"","",{"$nulls":6},"","","","","",{"$nulls":3},"","","","","",{"$f":"IF(D74=\"\",\"\",VLOOKUP(F74,'9. All Habitats + Multipliers'!$C$4:$K$102,5,FALSE))","v":""},{"$f":"IF(AG74=\"\",\"\",VLOOKUP(AG74,'11. Lists'!$B$47:$D$49,2,FALSE))","v":""},"",{"$f":"IF(AI74=\"\",\"\",VLOOKUP(AI74,'11. Lists'!$F$47:$G$51,2,FALSE))","v":""},{"$nulls":3},"",{"$f":"IF(AN74=\"\",\"\",VLOOKUP(AN74,'11. Lists'!$F$36:$H$38,2,FALSE))","v":""},{"$f":"IF(AN74=\"\",\"\",VLOOKUP(AN74,'11. Lists'!$F$36:$H$38,3,FALSE))","v":""},{"$f":"IF(D74=\"\",\"\",IF(AX74=\"Distinctiveness\",\"N/A\",VLOOKUP(F74,'10. Condition and Temporal'!$B$6:$L$103,11,FALSE)))","v":""},{"$f":"IF(AQ74=\"\",\"\",IF(AQ74=\"N/A\",\"1\",VLOOKUP(AQ74,'11. Lists'!$I$47:$K$80,3,FALSE)))","v":""},{"$f":"IF(D74=\"\",\"\",IF(AX74=\"Condition\",\"N/A\",VLOOKUP(F74,'10. Condition and Temporal'!$B$6:$M$106,12,FALSE)))","v":""},{"$f":"IF(AS74=\"\",\"\",IF(AS74=\"N/A\",\"1\",VLOOKUP(AS74,'11. Lists'!$I$47:$K$80,3,FALSE)))","v":""},{"$f":"IF(D74=\"\",\"\",VLOOKUP(F74,'9. All Habitats + Multipliers'!$C$4:$K$102,8,FALSE))","v":""},{"$f":"IF(AU74=\"\",\"\",VLOOKUP(AU74,'11. Lists'!$J$35:$K$38,2,FALSE))","v":""},{"$f":"IF(D74=\"\",\"\",VLOOKUP(D74,'10. Condition and Temporal'!$B$6:$M$103,4,FALSE))","v":""},"","",null,7,"","","","","","","","","","","","","","","","","","","","","","BH",{"$f":"BH66","v":0}]
[null,8,"","","",null,null,"","",{"$f":"IFERROR(IF(F75=\"\",\"\",VLOOKUP(F75,'10. Condition and Temporal'!$B$6:$F$103,5,FALSE)), \"Error ▲\")","v":""},null,"","",{"$nulls":6},"","","","","",{"$nulls":3},"","","","","",{"$f":"IF(D75=\"\",\"\",VLOOKUP(F75,'9. All Habitats + Multipliers'!$C$4:$K$102,5,FALSE))","v":""},{"$f":"IF(AG75=\"\",\"\",VLOOKUP(AG75,'11. Lists'!$B$47:$D$49,2,FALSE))","v":""},"",{"$f":"IF(AI75=\"\",\"\",VLOOKUP(AI75,'11. Lists'!$F$47:$G$51,2,FALSE))","v":""},{"$nulls":3},"",{"$f":"IF(AN75=\"\",\"\",VLOOKUP(AN75,'11. Lists'!$F$36:$H$38,2,FALSE))","v":""},{"$f":"IF(AN75=\"\",\"\",VLOOKUP(AN75,'11. Lists'!$F$36:$H$38,3,FALSE))","v":""},{"$f":"IF(D75=\"\",\"\",IF(AX75=\"Distinctiveness\",\"N/A\",VLOOKUP(F75,'10. Condition and Temporal'!$B$6:$L$103,11,FALSE)))","v":""},{"$f":"IF(AQ75=\"\",\"\",IF(AQ75=\"N/A\",\"1\",VLOOKUP(AQ75,'11. Lists'!$I$47:$K$80,3,FALSE)))","v":""},{"$f":"IF(D75=\"\",\"\",IF(AX75=\"Condition\",\"N/A\",VLOOKUP(F75,'10. Condition and Temporal'!$B$6:$M$106,12,FALSE)))","v":""},{"$f":"IF(AS75=\"\",\"\",IF(AS75=\"N/A\",\"1\",VLOOKUP(AS75,'11. Lists'!$I$47:$K$80,3,FALSE)))","v":""},{"$f":"IF(D75=\"\",\"\",VLOOKUP(F75,'9. All Habitats + Multipliers'!$C$4:$K$102,8,FALSE))","v":""},{"$f":"IF(AU75=\"\",\"\",VLOOKUP(AU75,'11. Lists'!$J$35:$K$38,2,FALSE))","v":""},{"$f":"IF(D75=\"\",\"\",VLOOKUP(D75,'10. Condition and Temporal'!$B$6:$M$103,4,FALSE))","v":""},"","",null,8,"","","","","","","","","","","","","","","","","","","","","","BI",{"$f":"BI66","v":0}]
[null,9,"","","",null,null,"","",{"$f":"IFERROR(IF(F76=\"\",\"\",VLOOKUP(F76,'10. Condition and Temporal'!$B$6:$F$103,5,FALSE)), \"Error ▲\")","v":""},null,"","",{"$nulls":6},"","","","","",{"$nulls":3},"","","","","",{"$f":"IF(D76=\"\",\"\",VLOOKUP(F76,'9. All Habitats + Multipliers'!$C$4:$K$102,5,FALSE))","v":""},{"$f":"IF(AG76=\"\",\"\",VLOOKUP(AG76,'11. Lists'!$B$47:$D$49,2,FALSE))","v":""},"",{"$f":"IF(AI76=\"\",\"\",VLOOKUP(AI76,'11. Lists'!$F$47:$G$51,2,FALSE))","v":""},{"$nulls":3},"",{"$f":"IF(AN76=\"\",\"\",VLOOKUP(AN76,'11. Lists'!$F$36:$H$38,2,FALSE))","v":""},{"$f":"IF(AN76=\"\",\"\",VLOOKUP(AN76,'11. Lists'!$F$36:$H$38,3,FALSE))","v":""},{"$f":"IF(D76=\"\",\"\",IF(AX76=\"Distinctiveness\",\"N/A\",VLOOKUP(F76,'10. Condition and Temporal'!$B$6:$L$103,11,FALSE)))","v":""},{"$f":"IF(AQ76=\"\",\"\",IF(AQ76=\"N/A\",\"1\",VLOOKUP(AQ76,'11. Lists'!$I$47:$K$80,3,FALSE)))","v":""},{"$f":"IF(D76=\"\",\"\",IF(AX76=\"Condition\",\"N/A\",VLOOKUP(F76,'10. Condition and Temporal'!$B$6:$M$106,12,FALSE)))","v":""},{"$f":"IF(AS76=\"\",\"\",IF(AS76=\"N/A\",\"1\",VLOOKUP(AS76,'11. Lists'!$I$47:$K$80,3,FALSE)))","v":""},{"$f":"IF(D76=\"\",\"\",VLOOKUP(F76,'9. All Habitats + Multipliers'!$C$4:$K$102,8,FALSE))","v":""},{"$f":"IF(AU76=\"\",\"\",VLOOKUP(AU76,'11. Lists'!$J$35:$K$38,2,FALSE))","v":""},{"$f":"IF(D76=\"\",\"\",VLOOKUP(D76,'10. Condition and Temporal'!$B$6:$M$103,4,FALSE))","v":""},"","",null,9,"","","","","","","","","","","","","","","","","","","","","","BJ",{"$f":"BJ66","v":0}]
[null,10,"","","",null,null,"","",{"$f":"IFERROR(IF(F77=\"\",\"\",VLOOKUP(F77,'10. Condition and Temporal'!$B$6:$F$103,5,FALSE)), \"Error ▲\")","v":""},null,"","",{"$nulls":6},"","","","","",{"$nulls":3},"","","","","",{"$f":"IF(D77=\"\",\"\",VLOOKUP(F77,'9. All Habitats + Multipliers'!$C$4:$K$102,5,FALSE))","v":""},{"$f":"IF(AG77=\"\",\"\",VLOOKUP(AG77,'11. Lists'!$B$47:$D$49,2,FALSE))","v":""},"",{"$f":"IF(AI77=\"\",\"\",VLOOKUP(AI77,'11. Lists'!$F$47:$G$51,2,FALSE))","v":""},{"$nulls":3},"",{"$f":"IF(AN77=\"\",\"\",VLOOKUP(AN77,'11. Lists'!$F$36:$H$38,2,FALSE))","v":""},{"$f":"IF(AN77=\"\",\"\",VLOOKUP(AN77,'11. Lists'!$F$36:$H$38,3,FALSE))","v":""},{"$f":"IF(D77=\"\",\"\",IF(AX77=\"Distinctiveness\",\"N/A\",VLOOKUP(F77,'10. Condition and Temporal'!$B$6:$L$103,11,FALSE)))","v":""},{"$f":"IF(AQ77=\"\",\"\",IF(AQ77=\"N/A\",\"1\",VLOOKUP(AQ77,'11. Lists'!$I$47:$K$80,3,FALSE)))","v":""},{"$f":"IF(D77=\"\",\"\",IF(AX77=\"Condition\",\"N/A\",VLOOKUP(F77,'10. Condition and Temporal'!$B$6:$M$106,12,FALSE)))","v":""},{"$f":"IF(AS77=\"\",\"\",IF(AS77=\"N/A\",\"1\",VLOOKUP(AS77,'11. Lists'!$I$47:$K$80,3,FALSE)))","v":""},{"$f":"IF(D77=\"\",\"\",VLOOKUP(F77,'9. All Habitats + Multipliers'!$C$4:$K$102,8,FALSE))","v":""},{"$f":"IF(AU77=\"\",\"\",VLOOKUP(AU77,'11. Lists'!$J$35:$K$38,2,FALSE))","v":""},{"$f":"IF(D77=\"\",\"\",VLOOKUP(D77,'10. Condition and Temporal'!$B$6:$M$103,4,FALSE))","v":""},"","",null,10,"","","","","","","","","","","","","","","","","","","","","","BK",{"$f":"BK66","v":0}]
[null,11,"","","",null,null,"","",{"$f":"IFERROR(IF(F78=\"\",\"\",VLOOKUP(F78,'10. Condition and Temporal'!$B$6:$F$103,5,FALSE)), \"Error ▲\")","v":""},null,"","",{"$nulls":6},"","","","","",{"$nulls":3},"","","","","",{"$f":"IF(D78=\"\",\"\",VLOOKUP(F78,'9. All Habitats + Multipliers'!$C$4:$K$102,5,FALSE))","v":""},{"$f":"IF(AG78=\"\",\"\",VLOOKUP(AG78,'11. Lists'!$B$47:$D$49,2,FALSE))","v":""},"",{"$f":"IF(AI78=\"\",\"\",VLOOKUP(AI78,'11. Lists'!$F$47:$G$51,2,FALSE))","v":""},{"$nulls":3},"",{"$f":"IF(AN78=\"\",\"\",VLOOKUP(AN78,'11. Lists'!$F$36:$H$38,2,FALSE))","v":""},{"$f":"IF(AN78=\"\",\"\",VLOOKUP(AN78,'11. Lists'!$F$36:$H$38,3,FALSE))","v":""},{"$f":"IF(D78=\"\",\"\",IF(AX78=\"Distinctiveness\",\"N/A\",VLOOKUP(F78,'10. Condition and Temporal'!$B$6:$L$103,11,FALSE)))","v":""},{"$f":"IF(AQ78=\"\",\"\",IF(AQ78=\"N/A\",\"1\",VLOOKUP(AQ78,'11. Lists'!$I$47:$K$80,3,FALSE)))","v":""},{"$f":"IF(D78=\"\",\"\",IF(AX78=\"Condition\",\"N/A\",VLOOKUP(F78,'10. Condition and Temporal'!$B$6:$M$106,12,FALSE)))","v":""},{"$f":"IF(AS78=\"\",\"\",IF(AS78=\"N/A\",\"1\",VLOOKUP(AS78,'11. Lists'!$I$47:$K$80,3,FALSE)))","v":""},{"$f":"IF(D78=\"\",\"\",VLOOKUP(F78,'9. All Habitats + Multipliers'!$C$4:$K$102,8,FALSE))","v":""},{"$f":"IF(AU78=\"\",\"\",VLOOKUP(AU78,'11. Lists'!$J$35:$K$38,2,FALSE))","v":""},{"$f":"IF(D78=\"\",\"\",VLOOKUP(D78,'10. Condition and Temporal'!$B$6:$M$103,4,FALSE))","v":""},"","",null,11,"","","","","","","","","","","","","","","","","","","","","","BL",{"$f":"BL66","v":0}]
[null,12,"","","",null,null,"","",{"$f":"IFERROR(IF(F79=\"\",\"\",VLOOKUP(F79,'10. Condition and Temporal'!$B$6:$F$103,5,FALSE)), \"Error ▲\")","v":""},null,"","",{"$nulls":6},"","","","","",{"$nulls":3},"","","","","",{"$f":"IF(D79=\"\",\"\",VLOOKUP(F79,'9. All Habitats + Multipliers'!$C$4:$K$102,5,FALSE))","v":""},{"$f":"IF(AG79=\"\",\"\",VLOOKUP(AG79,'11. Lists'!$B$47:$D$49,2,FALSE))","v":""},"",{"$f":"IF(AI79=\"\",\"\",VLOOKUP(AI79,'11. Lists'!$F$47:$G$51,2,FALSE))","v":""},{"$nulls":3},"",{"$f":"IF(AN79=\"\",\"\",VLOOKUP(AN79,'11. Lists'!$F$36:$H$38,2,FALSE))","v":""},{"$f":"IF(AN79=\"\",\"\",VLOOKUP(AN79,'11. Lists'!$F$36:$H$38,3,FALSE))","v":""},{"$f":"IF(D79=\"\",\"\",IF(AX79=\"Distinctiveness\",\"N/A\",VLOOKUP(F79,'10. Condition and Temporal'!$B$6:$L$103,11,FALSE)))","v":""},{"$f":"IF(AQ79=\"\",\"\",IF(AQ79=\"N/A\",\"1\",VLOOKUP(AQ79,'11. Lists'!$I$47:$K$80,3,FALSE)))","v":""},{"$f":"IF(D79=\"\",\"\",IF(AX79=\"Condition\",\"N/A\",VLOOKUP(F79,'10. Condition and Temporal'!$B$6:$M$106,12,FALSE)))","v":""},{"$f":"IF(AS79=\"\",\"\",IF(AS79=\"N/A\",\"1\",VLOOKUP(AS79,'11. Lists'!$I$47:$K$80,3,FALSE)))","v":""},{"$f":"IF(D79=\"\",\"\",VLOOKUP(F79,'9. All Habitats + Multipliers'!$C$4:$K$102,8,FALSE))","v":""},{"$f":"IF(AU79=\"\",\"\",VLOOKUP(AU79,'11. Lists'!$J$35:$K$38,2,FALSE))","v":""},{"$f":"IF(D79=\"\",\"\",VLOOKUP(D79,'10. Condition and Temporal'!$B$6:$M$103,4,FALSE))","v":""},"","",null,12,"","","","","","","","","","","","","","","","","","","","","","BM",{"$f":"BM66","v":0}]
[null,13,"","","",null,null,"","",{"$f":"IFERROR(IF(F80=\"\",\"\",VLOOKUP(F80,'10. Condition and Temporal'!$B$6:$F$103,5,FALSE)), \"Error ▲\")","v":""},null,"","",{"$nulls":6},"","","","","",{"$nulls":3},"","","","","",{"$f":"IF(D80=\"\",\"\",VLOOKUP(F80,'9. All Habitats + Multipliers'!$C$4:$K$102,5,FALSE))","v":""},{"$f":"IF(AG80=\"\",\"\",VLOOKUP(AG80,'11. Lists'!$B$47:$D$49,2,FALSE))","v":""},"",{"$f":"IF(AI80=\"\",\"\",VLOOKUP(AI80,'11. Lists'!$F$47:$G$51,2,FALSE))","v":""},{"$nulls":3},"",{"$f":"IF(AN80=\"\",\"\",VLOOKUP(AN80,'11. Lists'!$F$36:$H$38,2,FALSE))","v":""},{"$f":"IF(AN80=\"\",\"\",VLOOKUP(AN80,'11. Lists'!$F$36:$H$38,3,FALSE))","v":""},{"$f":"IF(D80=\"\",\"\",IF(AX80=\"Distinctiveness\",\"N/A\",VLOOKUP(F80,'10. Condition and Temporal'!$B$6:$L$103,11,FALSE)))","v":""},{"$f":"IF(AQ80=\"\",\"\",IF(AQ80=\"N/A\",\"1\",VLOOKUP(AQ80,'11. Lists'!$I$47:$K$80,3,FALSE)))","v":""},{"$f":"IF(D80=\"\",\"\",IF(AX80=\"Condition\",\"N/A\",VLOOKUP(F80,'10. Condition and Temporal'!$B$6:$M$106,12,FALSE)))","v":""},{"$f":"IF(AS80=\"\",\"\",IF(AS80=\"N/A\",\"1\",VLOOKUP(AS80,'11. Lists'!$I$47:$K$80,3,FALSE)))","v":""},{"$f":"IF(D80=\"\",\"\",VLOOKUP(F80,'9. All Habitats + Multipliers'!$C$4:$K$102,8,FALSE))","v":""},{"$f":"IF(AU80=\"\",\"\",VLOOKUP(AU80,'11. Lists'!$J$35:$K$38,2,FALSE))","v":""},{"$f":"IF(D80=\"\",\"\",VLOOKUP(D80,'10. Condition and Temporal'!$B$6:$M$103,4,FALSE))","v":""},"","",null,13,"","","","","","","","","","","","","","","","","","","","","","BN",{"$f":"BN66","v":0}]
[null,14,"","","",null,null,"","",{"$f":"IFERROR(IF(F81=\"\",\"\",VLOOKUP(F81,'10. Condition and Temporal'!$B$6:$F$103,5,FALSE)), \"Error ▲\")","v":""},null,"","",{"$nulls":6},"","","","","",{"$nulls":3},"","","","","",{"$f":"IF(D81=\"\",\"\",VLOOKUP(F81,'9. All Habitats + Multipliers'!$C$4:$K$102,5,FALSE))","v":""},{"$f":"IF(AG81=\"\",\"\",VLOOKUP(AG81,'11. Lists'!$B$47:$D$49,2,FALSE))","v":""},"",{"$f":"IF(AI81=\"\",\"\",VLOOKUP(AI81,'11. Lists'!$F$47:$G$51,2,FALSE))","v":""},{"$nulls":3},"",{"$f":"IF(AN81=\"\",\"\",VLOOKUP(AN81,'11. Lists'!$F$36:$H$38,2,FALSE))","v":""},{"$f":"IF(AN81=\"\",\"\",VLOOKUP(AN81,'11. Lists'!$F$36:$H$38,3,FALSE))","v":""},{"$f":"IF(D81=\"\",\"\",IF(AX81=\"Distinctiveness\",\"N/A\",VLOOKUP(F81,'10. Condition and Temporal'!$B$6:$L$103,11,FALSE)))","v":""},{"$f":"IF(AQ81=\"\",\"\",IF(AQ81=\"N/A\",\"1\",VLOOKUP(AQ81,'11. Lists'!$I$47:$K$80,3,FALSE)))","v":""},{"$f":"IF(D81=\"\",\"\",IF(AX81=\"Condition\",\"N/A\",VLOOKUP(F81,'10. Condition and Temporal'!$B$6:$M$106,12,FALSE)))","v":""},{"$f":"IF(AS81=\"\",\"\",IF(AS81=\"N/A\",\"1\",VLOOKUP(AS81,'11. Lists'!$I$47:$K$80,3,FALSE)))","v":""},{"$f":"IF(D81=\"\",\"\",VLOOKUP(F81,'9. All Habitats + Multipliers'!$C$4:$K$102,8,FALSE))","v":""},{"$f":"IF(AU81=\"\",\"\",VLOOKUP(AU81,'11. Lists'!$J$35:$K$38,2,FALSE))","v":""},{"$f":"IF(D81=\"\",\"\",VLOOKUP(D81,'10. Condition and Temporal'!$B$6:$M$103,4,FALSE))","v":""},"","",null,14,"","","","","","","","","","","","","","","","","","","","","","BO",{"$f":"BO66","v":0}]
[null,15,"","","",null,null,"","",{"$f":"IFERROR(IF(F82=\"\",\"\",VLOOKUP(F82,'10. Condition and Temporal'!$B$6:$F$103,5,FALSE)), \"Error ▲\")","v":""},null,"","",{"$nulls":6},"","","","","",{"$nulls":3},"","","","","",{"$f":"IF(D82=\"\",\"\",VLOOKUP(F82,'9. All Habitats + Multipliers'!$C$4:$K$102,5,FALSE))","v":""},{"$f":"IF(AG82=\"\",\"\",VLOOKUP(AG82,'11. Lists'!$B$47:$D$49,2,FALSE))","v":""},"",{"$f":"IF(AI82=\"\",\"\",VLOOKUP(AI82,'11. Lists'!$F$47:$G$51,2,FALSE))","v":""},{"$nulls":3},"",{"$f":"IF(AN82=\"\",\"\",VLOOKUP(AN82,'11. Lists'!$F$36:$H$38,2,FALSE))","v":""},{"$f":"IF(AN82=\"\",\"\",VLOOKUP(AN82,'11. Lists'!$F$36:$H$38,3,FALSE))","v":""},{"$f":"IF(D82=\"\",\"\",IF(AX82=\"Distinctiveness\",\"N/A\",VLOOKUP(F82,'10. Condition and Temporal'!$B$6:$L$103,11,FALSE)))","v":""},{"$f":"IF(AQ82=\"\",\"\",IF(AQ82=\"N/A\",\"1\",VLOOKUP(AQ82,'11. Lists'!$I$47:$K$80,3,FALSE)))","v":""},{"$f":"IF(D82=\"\",\"\",IF(AX82=\"Condition\",\"N/A\",VLOOKUP(F82,'10. Condition and Temporal'!$B$6:$M$106,12,FALSE)))","v":""},{"$f":"IF(AS82=\"\",\"\",IF(AS82=\"N/A\",\"1\",VLOOKUP(AS82,'11. Lists'!$I$47:$K$80,3,FALSE)))","v":""},{"$f":"IF(D82=\"\",\"\",VLOOKUP(F82,'9. All Habitats + Multipliers'!$C$4:$K$102,8,FALSE))","v":""},{"$f":"IF(AU82=\"\",\"\",VLOOKUP(AU82,'11. Lists'!$J$35:$K$38,2,FALSE))","v":""},{"$f":"IF(D82=\"\",\"\",VLOOKUP(D82,'10. Condition and Temporal'!$B$6:$M$103,4,FALSE))","v":""},"","",null,15,"","","","","","","","","","","","","","","","","","","","","","BP",{"$f":"BP66","v":0}]
[null,16,"","","",null,null,"","",{"$f":"IFERROR(IF(F83=\"\",\"\",VLOOKUP(F83,'10. Condition and Temporal'!$B$6:$F$103,5,FALSE)), \"Error ▲\")","v":""},null,"","",{"$nulls":6},"","","","","",{"$nulls":3},"","","","","",{"$f":"IF(D83=\"\",\"\",VLOOKUP(F83,'9. All Habitats + Multipliers'!$C$4:$K$102,5,FALSE))","v":""},{"$f":"IF(AG83=\"\",\"\",VLOOKUP(AG83,'11. Lists'!$B$47:$D$49,2,FALSE))","v":""},"",{"$f":"IF(AI83=\"\",\"\",VLOOKUP(AI83,'11. Lists'!$F$47:$G$51,2,FALSE))","v":""},{"$nulls":3},"",{"$f":"IF(AN83=\"\",\"\",VLOOKUP(AN83,'11. Lists'!$F$36:$H$38,2,FALSE))","v":""},{"$f":"IF(AN83=\"\",\"\",VLOOKUP(AN83,'11. Lists'!$F$36:$H$38,3,FALSE))","v":""},{"$f":"IF(D83=\"\",\"\",IF(AX83=\"Distinctiveness\",\"N/A\",VLOOKUP(F83,'10. Condition and Temporal'!$B$6:$L$103,11,FALSE)))","v":""},{"$f":"IF(AQ83=\"\",\"\",IF(AQ83=\"N/A\",\"1\",VLOOKUP(AQ83,'11. Lists'!$I$47:$K$80,3,FALSE)))","v":""},{"$f":"IF(D83=\"\",\"\",IF(AX83=\"Condition\",\"N/A\",VLOOKUP(F83,'10. Condition and Temporal'!$B$6:$M$106,12,FALSE)))","v":""},{"$f":"IF(AS83=\"\",\"\",IF(AS83=\"N/A\",\"1\",VLOOKUP(AS83,'11. Lists'!$I$47:$K$80,3,FALSE)))","v":""},{"$f":"IF(D83=\"\",\"\",VLOOKUP(F83,'9. All Habitats + Multipliers'!$C$4:$K$102,8,FALSE))","v":""},{"$f":"IF(AU83=\"\",\"\",VLOOKUP(AU83,'11. Lists'!$J$35:$K$38,2,FALSE))","v":""},{"$f":"IF(D83=\"\",\"\",VLOOKUP(D83,'10. Condition and Temporal'!$B$6:$M$103,4,FALSE))","v":""},"","",null,16,"","","","","","","","","","","","","","","","","","","","","","BQ",{"$f":"BQ66","v":0}]
[null,17,"","","",null,null,"","",{"$f":"IFERROR(IF(F84=\"\",\"\",VLOOKUP(F84,'10. Condition and Temporal'!$B$6:$F$103,5,FALSE)), \"Error ▲\")","v":""},null,"","",{"$nulls":6},"","","","","",{"$nulls":3},"","","","","",{"$f":"IF(D84=\"\",\"\",VLOOKUP(F84,'9. All Habitats + Multipliers'!$C$4:$K$102,5,FALSE))","v":""},{"$f":"IF(AG84=\"\",\"\",VLOOKUP(AG84,'11. Lists'!$B$47:$D$49,2,FALSE))","v":""},"",{"$f":"IF(AI84=\"\",\"\",VLOOKUP(AI84,'11. Lists'!$F$47:$G$51,2,FALSE))","v":""},{"$nulls":3},"",{"$f":"IF(AN84=\"\",\"\",VLOOKUP(AN84,'11. Lists'!$F$36:$H$38,2,FALSE))","v":""},{"$f":"IF(AN84=\"\",\"\",VLOOKUP(AN84,'11. Lists'!$F$36:$H$38,3,FALSE))","v":""},{"$f":"IF(D84=\"\",\"\",IF(AX84=\"Distinctiveness\",\"N/A\",VLOOKUP(F84,'10. Condition and Temporal'!$B$6:$L$103,11,FALSE)))","v":""},{"$f":"IF(AQ84=\"\",\"\",IF(AQ84=\"N/A\",\"1\",VLOOKUP(AQ84,'11. Lists'!$I$47:$K$80,3,FALSE)))","v":""},{"$f":"IF(D84=\"\",\"\",IF(AX84=\"Condition\",\"N/A\",VLOOKUP(F84,'10. Condition and Temporal'!$B$6:$M$106,12,FALSE)))","v":""},{"$f":"IF(AS84=\"\",\"\",IF(AS84=\"N/A\",\"1\",VLOOKUP(AS84,'11. Lists'!$I$47:$K$80,3,FALSE)))","v":""},{"$f":"IF(D84=\"\",\"\",VLOOKUP(F84,'9. All Habitats + Multipliers'!$C$4:$K$102,8,FALSE))","v":""},{"$f":"IF(AU84=\"\",\"\",VLOOKUP(AU84,'11. Lists'!$J$35:$K$38,2,FALSE))","v":""},{"$f":"IF(D84=\"\",\"\",VLOOKUP(D84,'10. Condition and Temporal'!$B$6:$M$103,4,FALSE))","v":""},"","",null,17,"","","","","","","","","","","","","","","","","","","","","","BR",{"$f":"BR66","v":0}]
[null,18,"","","",null,null,"","",{"$f":"IFERROR(IF(F85=\"\",\"\",VLOOKUP(F85,'10. Condition and Temporal'!$B$6:$F$103,5,FALSE)), \"Error ▲\")","v":""},null,"","",{"$nulls":6},"","","","","",{"$nulls":3},"","","","","",{"$f":"IF(D85=\"\",\"\",VLOOKUP(F85,'9. All Habitats + Multipliers'!$C$4:$K$102,5,FALSE))","v":""},{"$f":"IF(AG85=\"\",\"\",VLOOKUP(AG85,'11. Lists'!$B$47:$D$49,2,FALSE))","v":""},"",{"$f":"IF(AI85=\"\",\"\",VLOOKUP(AI85,'11. Lists'!$F$47:$G$51,2,FALSE))","v":""},{"$nulls":3},"",{"$f":"IF(AN85=\"\",\"\",VLOOKUP(AN85,'11. Lists'!$F$36:$H$38,2,FALSE))","v":""},{"$f":"IF(AN85=\"\",\"\",VLOOKUP(AN85,'11. Lists'!$F$36:$H$38,3,FALSE))","v":""},{"$f":"IF(D85=\"\",\"\",IF(AX85=\"Distinctiveness\",\"N/A\",VLOOKUP(F85,'10. Condition and Temporal'!$B$6:$L$103,11,FALSE)))","v":""},{"$f":"IF(AQ85=\"\",\"\",IF(AQ85=\"N/A\",\"1\",VLOOKUP(AQ85,'11. Lists'!$I$47:$K$80,3,FALSE)))","v":""},{"$f":"IF(D85=\"\",\"\",IF(AX85=\"Condition\",\"N/A\",VLOOKUP(F85,'10. Condition and Temporal'!$B$6:$M$106,12,FALSE)))","v":""},{"$f":"IF(AS85=\"\",\"\",IF(AS85=\"N/A\",\"1\",VLOOKUP(AS85,'11. Lists'!$I$47:$K$80,3,FALSE)))","v":""},{"$f":"IF(D85=\"\",\"\",VLOOKUP(F85,'9. All Habitats + Multipliers'!$C$4:$K$102,8,FALSE))","v":""},{"$f":"IF(AU85=\"\",\"\",VLOOKUP(AU85,'11. Lists'!$J$35:$K$38,2,FALSE))","v":""},{"$f":"IF(D85=\"\",\"\",VLOOKUP(D85,'10. Condition and Temporal'!$B$6:$M$103,4,FALSE))","v":""},"","",null,18,"","","","","","","","","","","","","","","","","","","","","","BS",{"$f":"BS66","v":0}]
[null,19,"","","",null,null,"","",{"$f":"IFERROR(IF(F86=\"\",\"\",VLOOKUP(F86,'10. Condition and Temporal'!$B$6:$F$103,5,FALSE)), \"Error ▲\")","v":""},null,"","",{"$nulls":6},"","","","","",{"$nulls":3},"","","","","",{"$f":"IF(D86=\"\",\"\",VLOOKUP(F86,'9. All Habitats + Multipliers'!$C$4:$K$102,5,FALSE))","v":""},{"$f":"IF(AG86=\"\",\"\",VLOOKUP(AG86,'11. Lists'!$B$47:$D$49,2,FALSE))","v":""},"",{"$f":"IF(AI86=\"\",\"\",VLOOKUP(AI86,'11. Lists'!$F$47:$G$51,2,FALSE))","v":""},{"$nulls":3},"",{"$f":"IF(AN86=\"\",\"\",VLOOKUP(AN86,'11. Lists'!$F$36:$H$38,2,FALSE))","v":""},{"$f":"IF(AN86=\"\",\"\",VLOOKUP(AN86,'11. Lists'!$F$36:$H$38,3,FALSE))","v":""},{"$f":"IF(D86=\"\",\"\",IF(AX86=\"Distinctiveness\",\"N/A\",VLOOKUP(F86,'10. Condition and Temporal'!$B$6:$L$103,11,FALSE)))","v":""},{"$f":"IF(AQ86=\"\",\"\",IF(AQ86=\"N/A\",\"1\",VLOOKUP(AQ86,'11. Lists'!$I$47:$K$80,3,FALSE)))","v":""},{"$f":"IF(D86=\"\",\"\",IF(AX86=\"Condition\",\"N/A\",VLOOKUP(F86,'10. Condition and Temporal'!$B$6:$M$106,12,FALSE)))","v":""},{"$f":"IF(AS86=\"\",\"\",IF(AS86=\"N/A\",\"1\",VLOOKUP(AS86,'11. Lists'!$I$47:$K$80,3,FALSE)))","v":""},{"$f":"IF(D86=\"\",\"\",VLOOKUP(F86,'9. All Habitats + Multipliers'!$C$4:$K$102,8,FALSE))","v":""},{"$f":"IF(AU86=\"\",\"\",VLOOKUP(AU86,'11. Lists'!$J$35:$K$38,2,FALSE))","v":""},{"$f":"IF(D86=\"\",\"\",VLOOKUP(D86,'10. Condition and Temporal'!$B$6:$M$103,4,FALSE))","v":""},"","",null,19,"","","","","","","","","","","","","","","","","","","","","","BT",{"$f":"BT66","v":0}]
[null,20,"","","",null,null,"","",{"$f":"IFERROR(IF(F87=\"\",\"\",VLOOKUP(F87,'10. Condition and Temporal'!$B$6:$F$103,5,FALSE)), \"Error ▲\")","v":""},null,"","",{"$nulls":6},"","","","","",{"$nulls":3},"","","","","",{"$f":"IF(D87=\"\",\"\",VLOOKUP(F87,'9. All Habitats + Multipliers'!$C$4:$K$102,5,FALSE))","v":""},{"$f":"IF(AG87=\"\",\"\",VLOOKUP(AG87,'11. Lists'!$B$47:$D$49,2,FALSE))","v":""},"",{"$f":"IF(AI87=\"\",\"\",VLOOKUP(AI87,'11. Lists'!$F$47:$G$51,2,FALSE))","v":""},{"$nulls":3},"",{"$f":"IF(AN87=\"\",\"\",VLOOKUP(AN87,'11. Lists'!$F$36:$H$38,2,FALSE))","v":""},{"$f":"IF(AN87=\"\",\"\",VLOOKUP(AN87,'11. Lists'!$F$36:$H$38,3,FALSE))","v":""},{"$f":"IF(D87=\"\",\"\",IF(AX87=\"Distinctiveness\",\"N/A\",VLOOKUP(F87,'10. Condition and Temporal'!$B$6:$L$103,11,FALSE)))","v":""},{"$f":"IF(AQ87=\"\",\"\",IF(AQ87=\"N/A\",\"1\",VLOOKUP(AQ87,'11. Lists'!$I$47:$K$80,3,FALSE)))","v":""},{"$f":"IF(D87=\"\",\"\",IF(AX87=\"Condition\",\"N/A\",VLOOKUP(F87,'10. Condition and Temporal'!$B$6:$M$106,12,FALSE)))","v":""},{"$f":"IF(AS87=\"\",\"\",IF(AS87=\"N/A\",\"1\",VLOOKUP(AS87,'11. Lists'!$I$47:$K$80,3,FALSE)))","v":""},{"$f":"IF(D87=\"\",\"\",VLOOKUP(F87,'9. All Habitats + Multipliers'!$C$4:$K$102,8,FALSE))","v":""},{"$f":"IF(AU87=\"\",\"\",VLOOKUP(AU87,'11. Lists'!$J$35:$K$38,2,FALSE))","v":""},{"$f":"IF(D87=\"\",\"\",VLOOKUP(D87,'10. Condition and Temporal'!$B$6:$M$103,4,FALSE))","v":""},"","",null,20,"","","","","","","","","","","","","","","","","","","","","","BU",{"$f":"BU66","v":0}]
[null,"Trees","Individual trees","Urban/rural tree","Condition","Urban/rural tree",null,"Area/compensation not in local strategy/ no local strategy",{"v":0,"d":"0.00"},{"$f":"IF(F88=\"\",\"\",VLOOKUP(F88,'10. Condition and Temporal'!$B$6:$F$103,5,FALSE))","v":"Good"},null,{"$f":"IFERROR(IF(D88=\"\",\"\",IF(AX88=\"Distinctiveness\",(((((I88*AH88*AJ88)-(I88*V88*X88))*(AV88*AT88))+(I88*V88*X88))*(AP88))/10000,((((I88*AJ88*AH88)-(I88*V88*X88))*(AV88*AR88))+(I88*V88*X88))*AP88/10000)),\"This intervention is not permitted within the SSM ▲\")","v":{"v":0,"d":"0.0000"}},{"$f":"L88-AD88","v":{"v":0,"d":"0.0000"}},{"$nulls":6},0,{"$f":"IF($D88=\"\",\"\",T31)","v":"Medium"},4,"Moderate",2,{"$nulls":3},"Formally identified in local strategy",1.15,{"$f":"IF(AC88=\"\",\"\",(T88*V88*X88)*(AA88*AC88)/10000)","v":0},{"$f":"IF(AD88=\"\",\"\",IF(AH88<V88,\"Not Acceptable\",\"Acceptable\"))","v":"Acceptable"},0,{"$f":"IF(D88=\"\",\"\",VLOOKUP(F88,'9. All Habitats + Multipliers'!$C$4:$K$102,5,FALSE))","v":"Medium"},{"$f":"IF(AG88=\"\",\"\",VLOOKUP(AG88,'11. Lists'!$B$47:$D$49,2,FALSE))","v":4},"Good",{"$f":"IF(AI88=\"\",\"\",VLOOKUP(AI88,'11. Lists'!$F$47:$G$51,2,FALSE))","v":3},{"$nulls":3},"Area/compensation not in local strategy/ no local strategy",{"$f":"IF(AN88=\"\",\"\",VLOOKUP(AN88,'11. Lists'!$F$36:$H$38,2,FALSE))","v":"Low Strategic Significance"},{"$f":"IF(AN88=\"\",\"\",VLOOKUP(AN88,'11. Lists'!$F$36:$H$38,3,FALSE))","v":1},{"$f":"IF(D88=\"\",\"\",VLOOKUP(F88,'10. Condition and Temporal'!$B$6:$L$103,11,FALSE))","v":16},{"$f":"IF(AQ88=\"\",\"\",VLOOKUP(AQ88,'11. Lists'!$I$47:$K$80,3,FALSE))","v":{"v":0.5655057348,"d":"0.566"}},{"$f":"IF(D88=\"\",\"\",VLOOKUP(F88,'10. Condition and Temporal'!$B$6:$M$106,12,FALSE))","v":"Not Possible"},{"$f":"IF(AS88=\"\",\"\",IF(AS88=\"N/A\",\"1\",VLOOKUP(AS88,'11. Lists'!$I$47:$K$80,3,FALSE)))","v":"N/A"},{"$f":"IF(D88=\"\",\"\",VLOOKUP(F88,'9. All Habitats + Multipliers'!$C$4:$K$102,8,FALSE))","v":"Low"},{"$f":"IF(AU88=\"\",\"\",VLOOKUP(AU88,'11. Lists'!$J$35:$K$38,2,FALSE))","v":1},{"$f":"IF(D88=\"\",\"\",VLOOKUP(D88,'10. Condition and Temporal'!$B$6:$M$103,4,FALSE))","v":"Urban/rural tree"},{"$f":"IF(F88=\"\",\"\",IF(D88=F88,\"Condition\",\"Distinctivness\"))","v":"Condition"},{"$f":"C88","v":"Individual trees"}]
[{"$nulls":7},"Totals (areas excl trees, green walls and intertidal hard structures)",{"$f":"SUMIFS(I68:I87,F68:F87,\"<>\"&'11. Lists'!Q10,F68:F87,\"<>\"&'11. Lists'!Q11,F68:F87,\"<>\"&'11. Lists'!I4,F68:F87,\"<>\"&'11. Lists'!I2,F68:F87,\"<>\"&'11. Lists'!I3)","v":{"v":0,"d":"0.00"}},null,null,{"$f":"SUM(L68:L88)","v":{"v":0,"d":"0.0000"}},{"$f":"SUM(M68:N88)","v":{"v":0,"d":"0.0000"}}]
[]
[null,"1d.  - Tree area calculator"]
[]
[null,"Tree size\n(Diameter at breast height)",null,"A. Total number of trees pre development","B. Number of trees retained (but not enhanced)",null,"C. Number of new trees planted post development",null,"Areas"]
[{"$nulls":8},"Area pre development",null,null,"Area retained",null,null,"Area of new trees planted post development"]
[null,"Small -DBH ≤ 30cm",null,2,1,null,3,null,{"$f":"D95*'11. Lists'!P47","v":{"v":81.38879999999999,"d":"81"}},null,null,{"$f":"IF(E95>D95, \"Error ▲\", E95*'11. Lists'!P47)","v":{"v":40.694399999999995,"d":"41"}},null,null,{"$f":"G95*'11. Lists'!P47","v":{"v":122.08319999999998,"d":"122"}}]
[null,"Medium - DBH > 30 to ≤ 60cm",null,1,1,{"$nulls":3},{"$f":"D96*'11. Lists'!P48","v":{"v":162.7776,"d":"163"}},null,null,{"$f":"IF(E96>D96,\"Error ▲\",(E96*'11. Lists'!P48))","v":{"v":162.7776,"d":"163"}},null,null,{"$f":"G96*'11. Lists'!P48","v":0}]
[null,"Large - DBH > 60 to ≤ 90cm",{"$nulls":6},{"$f":"D97*'11. Lists'!P49","v":0},null,null,{"$f":"IF(E97>D97,\"Error ▲\",(E97*'11. Lists'!P49))","v":0},null,null,{"$f":"G97*'11. Lists'!P49","v":0}]
[null,"Very Large - DBH > 90cm",{"$nulls":6},{"$f":"D98*'11. Lists'!P50","v":0},null,null,{"$f":"IF(E98>D98,\"Error ▲\",(E98*'11. Lists'!P50))","v":0},null,null,{"$f":"G98*'11. Lists'!P50","v":0}]
[null,"Total",null,{"$f":"SUM(D95:D98)","v":3},{"$f":"SUM(E95:F98)","v":2},null,{"$f":"SUM(G95:H98)","v":3},null,{"$f":"SUM(I95:K98)","v":{"v":244.1664,"d":"244"}},null,null,{"$f":"SUM(L95:N98)","v":{"v":203.472,"d":"203"}},null,null,{"$f":"SUM(O95:P98)","v":{"v":122.08319999999998,"d":"122"}}]
[{"$nulls":4},{"$f":"IFERROR(IF(OR(E95>D95, E96>D96, E97>D97, E98>D98), \"Error - trees retained and lost is greater than number of pre-development trees ▲\", \"\"), \"Error  ▲\")","v":""}]
[]
["Data beyond this row is automated"]
[]
[]
[]
[null,"1e . Trading Summary"]
[]
[null,"Broad Habitat Type - Medium Distinctiveness Habitats",null,null,{"$f":"IF(SUM(J114:J135)>0,\"Error - Trading Rules Not Satisfied - Insufficient Units Created Within Habitat Groups ▲\", \"Trading Rules Satisfied ✓\")","v":"Error - Trading Rules Not Satisfied - Insufficient Units Created Within Habitat Groups ▲"},{"$nulls":4},{"$f":"IFERROR(FIND(\"Error\",E108),0)","v":1}]
[null,"Medium and Low Distinctiveness Band ",null,null,{"$f":"IF(SUM(J138:J140)>0,\"Error - Trading Rules Not Satisfied - Insufficient Biodiversity Units Created ▲\",\"Trading Rules Satisfied ✓\")","v":"Error - Trading Rules Not Satisfied - Insufficient Biodiversity Units Created ▲"},{"$nulls":4},{"$f":"IFERROR(FIND(\"Error\",E109),0)","v":1}]
[]
[null,"1f . Habitat trading assessment"]
[]
[null,"Broad habitat types",null,null,"Distinctiveness band","Baseline units","Onsite provision","Net change","Trading satisfied?"]
[null,"Cropland",null,null,"Low",{"$f":"SUMIFS($L$11:$L$30,$C$11:$C$30,$B114,$T$11:$T$30,$E114)","v":{"v":0,"d":"0.0000"}},{"$f":"SUMIFS($L$40:$L$59,$C$40:$C$59,$B114,$T$40:$T$59,$E114)+SUMIFS($L$68:$L$87,AY68:AY87,B114,$AG$68:$AG$87,E114)+SUMIFS($AE$11:$AE$31,$C$11:$C$31,B114,$T$11:$T$31,E114)","v":{"v":0,"d":"0.0000"}},{"$f":"G114-F114","v":{"v":0,"d":"0.0000"}},"-"]
[{"$nulls":4},"Medium",{"$f":"SUMIFS($L$11:$L$30,$C$11:$C$30,$B114,$T$11:$T$30,$E115)","v":{"v":0,"d":"0.0000"}},{"$f":"SUMIFS($L$40:$L$59,$C$40:$C$59,$B114,$T$40:$T$59,$E115)+SUMIFS($L$68:$L$87,AY68:AY87,B114,$AG$68:$AG$87,E115)+SUMIFS($AE$11:$AE$31,$C$11:$C$31,B114,$T$11:$T$31,E115)","v":{"v":0,"d":"0.0000"}},{"$f":"G115-F115","v":{"v":0,"d":"0.0000"}},{"$f":"IF(F115=0,\"N/A\",IF(H115<0,\"No ▲\",\"Yes ✓\"))","v":"N/A"},{"$f":"IF(I115=\"No ▲\",1,0)","v":0}]
[null,"Grassland",null,null,"Low",{"$f":"SUMIFS($L$11:$L$30,$C$11:$C$30,$B116,$T$11:$T$30,$E116)","v":{"v":0,"d":"0.0000"}},{"$f":"SUMIFS($L$40:$L$59,$C$40:$C$59,$B116,$T$40:$T$59,$E116)+SUMIFS($L$68:$L$87,AY68:AY87,B116,$AG$68:$AG$87,E116)+SUMIFS($AE$11:$AE$31,$C$11:$C$31,B116,$T$11:$T$31,E116)","v":{"v":0,"d":"0.0000"}},{"$f":"G116-F116","v":{"v":0,"d":"0.0000"}},"-"]
[{"$nulls":4},"Medium",{"$f":"SUMIFS($L$11:$L$30,$C$11:$C$30,$B116,$T$11:$T$30,$E117)","v":{"v":0,"d":"0.0000"}},{"$f":"SUMIFS($L$40:$L$59,$C$40:$C$59,$B116,$T$40:$T$59,$E117)+SUMIFS($L$68:$L$87,AY68:AY87,B116,$AG$68:$AG$87,E117)+SUMIFS($AE$11:$AE$31,$C$11:$C$31,B116,$T$11:$T$31,E117)","v":{"v":0,"d":"0.0000"}},{"$f":"G117-F117","v":{"v":0,"d":"0.0000"}},{"$f":"IF(F117=0,\"N/A\",IF(H117<0,\"No ▲\",\"Yes ✓\"))","v":"N/A"},{"$f":"IF(I117=\"No ▲\",1,0)","v":0}]
[null,"Heathland and shrub",null,null,"Low",{"$f":"SUMIFS($L$11:$L$30,$C$11:$C$30,$B118,$T$11:$T$30,$E118)","v":{"v":0,"d":"0.0000"}},{"$f":"SUMIFS($L$40:$L$59,$C$40:$C$59,$B118,$T$40:$T$59,$E118)+SUMIFS($L$68:$L$87,$C$68:$C$87,B118,$AG$68:$AG$87,E118)+SUMIFS($AE$11:$AE$31,$C$11:$C$31,B118,$T$11:$T$31,E118)","v":{"v":0,"d":"0.0000"}},{"v":0,"d":"0.0000"},"-"]
[{"$nulls":4},"Medium",{"$f":"SUMIFS($L$11:$L$30,$C$11:$C$30,$B118,$T$11:$T$30,$E119)","v":{"v":0,"d":"0.0000"}},{"$f":"SUMIFS($L$40:$L$59,$C$40:$C$59,$B118,$T$40:$T$59,$E119)+SUMIFS($L$68:$L$87,$C$68:$C$87,B118,$AG$68:$AG$87,E119)+SUMIFS($AE$11:$AE$31,$C$11:$C$31,B118,$T$11:$T$31,E119)","v":{"v":0,"d":"0.0000"}},{"v":0,"d":"0.0000"},{"$f":"IF(F119=0,\"N/A\",IF(H119<0,\"No ▲\",\"Yes ✓\"))","v":"N/A"},{"$f":"IF(I119=\"No ▲\",1,0)","v":0}]
[null,"Intertidal hard structures",null,null,"Low",{"$f":"SUMIFS($L$11:$L$30,$C$11:$C$30,$B120,$T$11:$T$30,$E120)","v":{"v":0,"d":"0.0000"}},{"$f":"SUMIFS($L$40:$L$59,$C$40:$C$59,$B120,$T$40:$T$59,$E120)+SUMIFS($L$68:$L$87,$C$68:$C$87,B120,$AG$68:$AG$87,E120)+SUMIFS($AE$11:$AE$31,$C$11:$C$31,B120,$T$11:$T$31,E120)","v":{"v":0,"d":"0.0000"}},{"$f":"G120-F120","v":{"v":0,"d":"0.0000"}},"-"]
[{"$nulls":4},"Medium",{"$f":"SUMIFS($L$11:$L$30,$C$11:$C$30,$B120,$T$11:$T$30,$E121)","v":{"v":0,"d":"0.0000"}},{"$f":"SUMIFS($L$40:$L$59,$C$40:$C$59,$B120,$T$40:$T$59,$E121)+SUMIFS($L$68:$L$87,$C$68:$C$87,B120,$AG$68:$AG$87,E121)+SUMIFS($AE$11:$AE$31,$C$11:$C$31,B120,$T$11:$T$31,E121)","v":{"v":0,"d":"0.0000"}},{"v":0,"d":"0.0000"},{"$f":"IF(F121=0,\"N/A\",IF(H121<0,\"No ▲\",\"Yes ✓\"))","v":"N/A"},{"$f":"IF(I121=\"No ▲\",1,0)","v":0}]
[null,"Intertidal sediment",null,null,"Low",{"$f":"SUMIFS($L$11:$L$30,$C$11:$C$30,$B122,$T$11:$T$30,$E122)","v":{"v":0,"d":"0.0000"}},{"$f":"SUMIFS($L$40:$L$59,$C$40:$C$59,$B122,$T$40:$T$59,$E122)+SUMIFS($L$68:$L$87,$C$68:$C$87,B122,$AG$68:$AG$87,E122)+SUMIFS($AE$11:$AE$31,$C$11:$C$31,B122,$T$11:$T$31,E122)","v":{"v":0,"d":"0.0000"}},{"v":0,"d":"0.0000"},"-"]
[{"$nulls":4},"Medium",{"$f":"SUMIFS($L$11:$L$30,$C$11:$C$30,$B122,$T$11:$T$30,$E123)","v":{"v":0,"d":"0.0000"}},{"$f":"SUMIFS($L$40:$L$59,$C$40:$C$59,$B$122,$T$40:$T$59,$E$123)+SUMIFS($L$68:$L$87,$C$68:$C$87,$B$122,$AG$68:$AG$87,$E$123)+SUMIFS($AE$11:$AE$31,$C$11:$C$31,$B$122,$T$11:$T$31,$E$123)","v":{"v":0,"d":"0.0000"}},{"v":0,"d":"0.0000"},{"$f":"IF(F123=0,\"N/A\",IF(H123<0,\"No ▲\",\"Yes ✓\"))","v":"N/A"},{"$f":"IF(I123=\"No ▲\",1,0)","v":0}]
[null,"Lakes",null,null,"Low",{"$f":"SUMIFS($L$11:$L$30,$C$11:$C$30,$B124,$T$11:$T$30,$E124)","v":{"v":0,"d":"0.0000"}},{"$f":"SUMIFS($L$40:$L$59,$C$40:$C$59,$B124,$T$40:$T$59,$E124)+SUMIFS($L$68:$L$87,$C$68:$C$87,B124,$AG$68:$AG$87,E124)+SUMIFS($AE$11:$AE$31,$C$11:$C$31,B124,$T$11:$T$31,E124)","v":{"v":0,"d":"0.0000"}},{"v":0,"d":"0.0000"},"-"]
[{"$nulls":4},"Medium",{"$f":"SUMIFS($L$11:$L$30,$C$11:$C$30,$B124,$T$11:$T$30,$E125)","v":{"v":0,"d":"0.0000"}},{"$f":"SUMIFS($L$40:$L$59,$C$40:$C$59,$B$124,$T$40:$T$59,$E125)+SUMIFS($L$68:$L$87,$C$68:$C$87,B124,$AG$68:$AG$87,E125)+SUMIFS($AE$11:$AE$31,$C$11:$C$31,$B$124,$T$11:$T$31,$E$125)","v":{"v":0,"d":"0.0000"}},{"$f":"G125-F125","v":{"v":0,"d":"0.0000"}},{"$f":"IF(F125=0,\"N/A\",IF(H125<0,\"No ▲\",\"Yes ✓\"))","v":"N/A"},{"$f":"IF(I125=\"No ▲\",1,0)","v":0}]
[null,"Sparsely vegetated land",null,null,"Low",{"$f":"SUMIFS($L$11:$L$30,$C$11:$C$30,$B126,$T$11:$T$30,$E126)","v":{"v":0,"d":"0.0000"}},{"$f":"SUMIFS($L$40:$L$59,$C$40:$C$59,$B126,$T$40:$T$59,$E126)+SUMIFS($L$68:$L$87,AY68:AY87,B126,$AG$68:$AG$87,E126)+SUMIFS($AE$11:$AE$31,$C$11:$C$31,B126,$T$11:$T$31,E126)","v":{"v":0,"d":"0.0000"}},{"v":0,"d":"0.0000"},"-"]
[{"$nulls":4},"Medium",{"$f":"SUMIFS($L$11:$L$30,$C$11:$C$30,$B126,$T$11:$T$30,$E127)","v":{"v":0,"d":"0.0000"}},{"$f":"SUMIFS($L$40:$L$59,$C$40:$C$59,$B126,$T$40:$T$59,$E127)+SUMIFS($L$68:$L$87,AY68:AY87,B126,$AG$68:$AG$87,E127)+SUMIFS($AE$11:$AE$31,$C$11:$C$31,B126,$T$11:$T$31,E127)","v":{"v":0,"d":"0.0000"}},{"v":0,"d":"0.0000"},{"$f":"IF(F127=0,\"N/A\",IF(H127<0,\"No ▲\",\"Yes ✓\"))","v":"N/A"},{"$f":"IF(I127=\"No ▲\",1,0)","v":0}]
[null,"Urban",null,null,"Low",{"$f":"SUMIFS($L$11:$L$30,$C$11:$C$30,$B128,$T$11:$T$30,$E128)","v":{"v":0.049,"d":"0.0490"}},{"$f":"SUMIFS($L$40:$L$59,$C$40:$C$59,$B128,$T$40:$T$59,$E128)+SUMIFS($L$68:$L$87,AY68:AY87,B128,$AG$68:$AG$87,E128)+SUMIFS($AE$11:$AE$31,$C$11:$C$31,B128,$T$11:$T$31,E128)","v":{"v":0.01737,"d":"0.0174"}},{"v":-0.031630000000000005,"d":"-0.0316"},"-"]
[{"$nulls":4},"Medium",{"$f":"SUMIFS($L$11:$L$30,$C$11:$C$30,$B128,$T$11:$T$30,$E129)","v":{"v":0,"d":"0.0000"}},{"$f":"SUMIFS($L$40:$L$59,$C$40:$C$59,$B128,$T$40:$T$59,$E129)+SUMIFS($L$68:$L$87,AY68:AY87,B128,$AG$68:$AG$87,E129)+SUMIFS($AE$11:$AE$31,$C$11:$C$31,B128,$T$11:$T$31,E129)","v":{"v":0,"d":"0.0000"}},{"v":0,"d":"0.0000"},{"$f":"IF(F129=0,\"N/A\",IF(H129<0,\"No ▲\",\"Yes ✓\"))","v":"N/A"},{"$f":"IF(I129=\"No ▲\",1,0)","v":0}]
[null,"Woodland and forest",null,null,"Low",{"$f":"SUMIFS($L$11:$L$30,$C$11:$C$30,$B130,$T$11:$T$30,$E130)","v":{"v":0,"d":"0.0000"}},{"$f":"SUMIFS($L$40:$L$59,$C$40:$C$59,$B130,$T$40:$T$59,$E130)+SUMIFS($L$68:$L$87,$C$68:$C$87,B130,$AG$68:$AG$87,E130)+SUMIFS($AE$11:$AE$31,$C$11:$C$31,B130,$T$11:$T$31,E130)","v":{"v":0,"d":"0.0000"}},{"v":0,"d":"0.0000"},"-"]
[{"$nulls":4},"Medium",{"$f":"SUMIFS($L$11:$L$30,$C$11:$C$30,$B130,$T$11:$T$30,$E131)","v":{"v":0,"d":"0.0000"}},{"$f":"SUMIFS($L$40:$L$59,$C$40:$C$59,$B130,$T$40:$T$59,$E131)+SUMIFS($L$68:$L$87,$C$68:$C$87,B130,$AG$68:$AG$87,E131)+SUMIFS($AE$11:$AE$31,$C$11:$C$31,B130,$T$11:$T$31,E131)","v":{"v":0,"d":"0.0000"}},{"v":0,"d":"0.0000"},{"$f":"IF(F131=0,\"N/A\",IF(H131<0,\"No ▲\",\"Yes ✓\"))","v":"N/A"},{"$f":"IF(I131=\"No ▲\",1,0)","v":0}]
[null,"Coastal saltmarsh",null,null,"Low",{"$f":"SUMIFS($L$11:$L$30,$C$11:$C$30,$B132,$T$11:$T$30,$E132)","v":{"v":0,"d":"0.0000"}},{"$f":"SUMIFS($L$40:$L$59,$C$40:$C$59,$B132,$T$40:$T$59,$E132)+SUMIFS($L$68:$L$87,$C$68:$C$87,B132,$AG$68:$AG$87,E132)+SUMIFS($AE$11:$AE$31,$C$11:$C$31,B132,$T$11:$T$31,E132)","v":{"v":0,"d":"0.0000"}},{"$f":"G132-F132","v":{"v":0,"d":"0.0000"}},"-"]
[{"$nulls":4},"Medium",{"$f":"SUMIFS($L$11:$L$30,$C$11:$C$30,$B132,$T$11:$T$30,$E133)","v":{"v":0,"d":"0.0000"}},{"$f":"SUMIFS($L$40:$L$59,$C$40:$C$59,$B132,$T$40:$T$59,$E133)+SUMIFS($L$68:$L$87,$C$68:$C$87,B132,$AG$68:$AG$87,E133)+SUMIFS($AE$11:$AE$31,$C$11:$C$31,B132,$T$11:$T$31,E133)","v":{"v":0,"d":"0.0000"}},{"$f":"G133-F133","v":{"v":0,"d":"0.0000"}},{"$f":"IF(F133=0,\"N/A\",IF(H133<0,\"No ▲\",\"Yes ✓\"))","v":"N/A"},{"$f":"IF(I133=\"No ▲\",1,0)","v":0}]
[null,"Individual trees",null,null,"Low",{"$f":"SUMIFS($L$11:$L$31,$C$11:$C$31,$B134,$T$11:$T$31,$E134)","v":{"v":0,"d":"0.0000"}},{"$f":"SUMIFS($L$40:$L$60,$C$40:$C$60,$B134,$T$40:$T$60,$E134)+SUMIFS($L$68:$L$88,$C$68:$C$88,B134,$AG$68:$AG$88,E134)+SUMIFS($AE$11:$AE$31,$C$11:$C$31,B134,$T$11:$T$31,E134)","v":{"v":0,"d":"0.0000"}},{"$f":"G134-F134","v":{"v":0,"d":"0.0000"}},"-"]
[{"$nulls":4},"Medium",{"$f":"SUMIFS($L$11:$L$31,$C$11:$C$31,$B134,$T$11:$T$31,$E135)","v":{"v":0.22463308799999998,"d":"0.2246"}},{"$f":"SUMIFS($L$40:$L$60,$C$40:$C$60,$B134,$T$40:$T$60,$E135)+SUMIFS($L$68:$L$88,$C$68:$C$88,B134,$AG$68:$AG$88,E135)+SUMIFS($AE$11:$AE$31,$C$11:$C$31,B134,$T$11:$T$31,E135)","v":{"v":0.22451782497959574,"d":"0.2245"}},{"$f":"G135-F135","v":{"v":-1.1526302040423819E-4,"d":"-0.0001"}},{"$f":"IF(F135=0,\"N/A\",IF(H135<0,\"No ▲\",\"Yes ✓\"))","v":"No ▲"},{"$f":"IF(I135=\"No ▲\",1,0)","v":1}]
[]
[null,"Distinctiveness band",{"$nulls":3},"Baseline units","Onsite provision","Net change","Trading satisfied?"]
[null,"Medium distinctiveness",{"$nulls":3},{"$f":"SUMIFS($L$11:$L$31,$T$11:$T$31,\"Medium\")","v":{"v":0.22463308799999998,"d":"0.2246"}},{"$f":"IF(L61+L89+P1=0,0,SUMIFS($L$40:$L$60,$T$40:$T$60,\"Medium\")+SUMIFS($L$68:$L$87,$AG$68:$AG$87,\"Medium\")+SUMIFS($AE$11:$AE$31,$T$11:$T$31,\"Medium\"))","v":{"v":0.22451782497959574,"d":"0.225"}},{"$f":"IFERROR(G138-F138,\"\")","v":{"v":-1.1526302040423819E-4,"d":"-0.0001"}},{"$f":"IF(G138=\"\",\"\",IF(H138>=0,\"Yes ✓\",\"No ▲\"))","v":"No ▲"},1,{"$nulls":7},"Data beyond this column is automated"]
[null,"Low distinctiveness",{"$nulls":3},{"$f":"SUMIFS($L$11:$L$31,$T$11:$T$31,\"Low\")","v":{"v":0.049,"d":"0.0490"}},{"$f":"IF(L61+L89+P1=0,0,SUMIFS($L$40:$L$60,$T$40:$T$60,\"Low\")+SUMIFS($L$68:$L$88,$AG$68:$AG$88,\"Low\")+SUMIFS($AE$11:$AE$31,$T$11:$T$31,\"Low\"))","v":{"v":0.01737,"d":"0.017"}},{"$f":"IFERROR(G139-F139,\"\")","v":{"v":-0.031630000000000005,"d":"-0.0316"}},{"$f":"IF($I$142>=0,\"Yes ✓\",\"No ▲\")","v":"No ▲"},1]
[null,"Surplus area habitat biodiversity units after offsetting low distinctiveness units",{"$nulls":3},{"$f":"IFERROR(H138+H139,\"\")","v":{"v":-0.031745263020404244,"d":"-0.0317"}},null,null,{"$f":"IF(F140=\"\",\"\",IF(F140>=0,\"Yes ✓\",\"No ▲\"))","v":"No ▲"},1]
[]
[{"$nulls":8},{"$f":"IF($H$138>0,($H$139+$H$138),$H$139)","v":-0.031630000000000005}]

{"sheet":"6. Hedges & Lines of Trees","index":5,"n_rows":117,"n_cols":76,"rows_kept":117,"merged":[[0,17,30,17],[1,2,1,3],[1,5,5,7],[1,9,4,12],[2,2,2,3],[8,1,9,1],[8,2,8,4],[8,5,9,7],[8,8,8,10],[8,11,8,13],[8,14,8,15],[8,19,8,21],[8,22,8,23],[8,24,8,26],[8,27,8,29],[8,30,8,32],[8,33,9,33],[8,34,9,34],[9,3,9,4],[9,19,9,20],[10,3,10,4],[10,5,10,7],[10,19,10,20],[11,3,11,4],[11,5,11,7],[11,19,11,20],[12,3,12,4],[12,5,12,7],[12,19,12,20],[13,3,13,4],[13,5,13,7],[13,19,13,20],[14,3,14,4],[14,5,14,7],[14,19,14,20],[15,3,15,4],[15,5,15,7],[15,19,15,20],[16,3,16,4],[16,5,16,7],[16,19,16,20],[17,3,17,4],[17,5,17,7],[17,19,17,20],[18,3,18,4],[18,5,18,7],[18,19,18,20],[19,3,19,4],[19,5,19,7],[19,19,19,20],[20,3,20,4],[20,5,20,7],[20,19,20,20],[21,3,21,4],[21,5,21,7],[21,19,21,20],[22,3,22,4],[22,5,22,7],[22,19,22,20],[23,3,23,4],[23,5,23,7],[23,19,23,20],[24,3,24,4],[24,5,24,7],[24,19,24,20],[25,3,25,4],[25,5,25,7],[25,19,25,20],[26,3,26,4],[26,5,26,7],[26,19,26,20],[27,3,27,4],[27,5,27,7],[27,19,27,20],[28,3,28,4],[28,5,28,7],[28,19,28,20],[29,3,29,4],[29,5,29,7],[29,19,29,20],[31,8,31,13],[32,8,32,13],[33,17,61,17],[36,1,37,1],[36,2,36,3],[36,4,36,6],[36,7,37,7],[36,8,37,10],[36,11,37,13],[36,14,36,15],[36,19,36,21],[36,22,36,23],[36,24,36,26],[36,27,36,29],[36,30,36,31],[36,32,36,33],[37,5,37,6],[37,19,37,20],[38,5,38,6],[38,8,38,10],[38,11,38,13],[38,19,38,20],[39,5,39,6],[39,8,39,10],[39,11,39,13],[39,19,39,20],[40,5,40,6],[40,8,40,10],[40,11,40,13],[40,19,40,20],[41,5,41,6],[41,8,41,10],[41,11,41,13],[41,19,41,20],[42,5,42,6],[42,8,42,10],[42,11,42,13],[42,19,42,20],[43,5,43,6],[43,8,43,10],[43,11,43,13],[43,19,43,20],[44,5,44,6],[44,8,44,10],[44,11,44,13],[44,19,44,20],[45,5,45,6],[45,8,45,10],[45,11,45,13],[45,19,45,20],[46,5,46,6],[46,8,46,10],[46,11,46,13],[46,19,46,20],[47,5,47,6],[47,8,47,10],[47,11,47,13],[47,19,47,20],[48,5,48,6],[48,8,48,10],[48,11,48,13],[48,19,48,20],[49,5,49,6],[49,8,49,10],[49,11,49,13],[49,19,49,20],[50,5,50,6],[50,8,50,10],[50,11,50,13],[50,19,50,20],[51,5,51,6],[51,8,51,10],[51,11,51,13],[51,19,51,20],[52,5,52,6],[52,8,52,10],[52,11,52,13],[52,19,52,20],[53,5,53,6],[53,8,53,10],[53,11,53,13],[53,19,53,20],[54,5,54,6],[54,8,54,10],[54,11,54,13],[54,19,54,20],[55,5,55,6],[55,8,55,10],[55,11,55,13],[55,19,55,20],[56,5,56,6],[56,8,56,10],[56,11,56,13],[56,19,56,20],[57,5,57,6],[57,8,57,10],[57,11,57,13],[57,19,57,20],[58,8,58,10],[58,11,58,13],[59,8,59,13],[62,0,64,0],[62,17,87,17],[63,1,64,1],[63,2,63,3],[63,4,63,6],[63,7,64,7],[63,8,64,8],[63,9,64,10],[63,11,64,11],[63,12,64,13],[63,14,63,15],[63,19,63,29],[63,30,64,30],[63,31,63,41],[63,42,64,42],[63,43,63,49],[64,5,64,6],[65,5,65,6],[65,9,65,10],[65,12,65,13],[66,5,66,6],[66,9,66,10],[66,12,66,13],[67,5,67,6],[67,9,67,10],[67,12,67,13],[68,5,68,6],[68,9,68,10],[68,12,68,13],[69,5,69,6],[69,9,69,10],[69,12,69,13],[70,5,70,6],[70,9,70,10],[70,12,70,13],[71,5,71,6],[71,9,71,10],[71,12,71,13],[72,5,72,6],[72,9,72,10],[72,12,72,13],[73,5,73,6],[73,9,73,10],[73,12,73,13],[74,5,74,6],[74,9,74,10],[74,12,74,13],[75,5,75,6],[75,9,75,10],[75,12,75,13],[76,5,76,6],[76,9,76,10],[76,12,76,13],[77,5,77,6],[77,9,77,10],[77,12,77,13],[78,5,78,6],[78,9,78,10],[78,12,78,13],[79,5,79,6],[79,9,79,10],[79,12,79,13],[80,5,80,6],[80,9,80,10],[80,12,80,13],[81,5,81,6],[81,9,81,10],[81,12,81,13],[82,5,82,6],[82,9,82,10],[82,12,82,13],[83,5,83,6],[83,9,83,10],[83,12,83,13],[84,5,84,6],[84,9,84,10],[84,12,84,13],[85,12,85,13],[88,17,96,17],[90,0,92,16],[96,1,96,3],[96,4,96,8],[97,17,99,17],[100,17,126,17],[102,1,112,1],[102,2,107,2],[102,7,107,7],[108,2,111,2],[108,7,111,7],[114,1,114,4],[115,1,115,4],[116,1,116,4]]}
[{"$nulls":14},"Retained Units",{"$f":"IFERROR(SUM(AE11:AE30), \"Error ▲\")","v":{"v":0,"d":"0.0000"}},null,"Data beyond this column is automated"]
[null,"Site Name",{"$f":"IF('2. Site Details'!D4=\"\",\"Enter site name on 2. Site Details\",'2. Site Details'!D4)","v":" 'Glenside' 45 Windmill Lane, Alton, Hampshire GU34 2SN"},null,null,"Instructions:\n\n1. Enter data into 1a. Baseline habitats \n2. Enter data on habitats to be created into 1b. Habitats to be created\n3. Enter data on habitats to be enhanced into 1c. Habitats to be enhanced\n",{"$nulls":3},{"$f":"IFERROR(IF(OR((ISNUMBER(SEARCH(\"▲\",A7:Q101)))),\"Input Errors Present On Sheet - Red Cells Or ▲ Highlight Errors\",\"All Key Rules Satisfied ✓ \"),\"Technical Errors On Sheet ▲\")","v":"All Key Rules Satisfied ✓ "},{"$nulls":4},"Lost Units",{"$f":"IFERROR(N31, \"Error ▲\")","v":{"v":0,"d":"0.0000"}}]
[null,"Sheet Name","6. Hedges & Lines of Trees",{"$nulls":11},"Created Units",{"$f":"IFERROR(L59, \"Error ▲\")","v":{"v":0.05086538813460001,"d":"0.0509"}}]
[{"$nulls":14},"Enhancement Units",{"$f":"IFERROR(L86, \"Error ▲\")","v":{"v":0,"d":"0.0000"}}]
[{"$nulls":14},"Net Change",{"$f":"IFERROR(P1+L59+L86-L31, \"Error ▲\")","v":{"v":0.05086538813460001,"d":"0.0509"}}]
[]
[null,"1a. Baseline habitats"]
[]
[null,"Ref","Habitat",null,null,"C. Strategic significance",null,null,"Length (m)",null,null,"Baseline results",null,null,"Comments",{"$nulls":4},"Habitat distinctiveness",null,null,"Habitat condition",{"$nulls":4},"Strategic significance",null,null,"Ecological baseline",null,null,"Suggested action to address habitat losses","Enhancement rules"]
[null,null,"A. Broad Habitat"," B. Habitat type",{"$nulls":4},"D. Total Length","E. Length retained","F. Length enhanced","Total  units onsite","Length Lost","Units lost","User comments","LPA comments",{"$nulls":3},"Distinctiveness",null,"Score","Condition ","Score",{"$nulls":3},"Strategic significance","Strategic significance","Strategic significance multiplier","Baseline units retained","Baseline units to be enhanced","Area lost"]
[null,1,"Hedgerows and Lines of trees",{"$nulls":8},{"$f":"IF(D11=\"\",\"\",IFERROR(IF(I11=\"\",\"\",((I11/1000)*V11*X11)*AD11),\"This intervention is not permitted within the SSM ▲\"))","v":""},{"$f":"IF(I11=\"\",\"\",IF(J11+K11>I11,\"Length Error ▲\",I11-J11-K11))","v":""},{"$f":"IFERROR(IF(I11=\"\",\"\",IF(M11=\"Length Error ▲\",\"Length Error ▲\",((M11/1000)*V11*X11)*AD11)),\"This intervention is not permitted within the SSM ▲\")","v":""},{"$nulls":5},{"$f":"IF(D11=\"\",\"\",VLOOKUP(D11,'9. All Habitats + Multipliers'!$C$4:$K$102,5,FALSE))","v":""},null,{"$f":"IF(T11=\"\",\"\",VLOOKUP(T11,'11. Lists'!$S$47:$U$50,2,FALSE))","v":""},{"$f":"IF(D11=\"\",\"\",VLOOKUP(D11,'10. Condition and Temporal'!$B$6:$C$103,2,FALSE))","v":""},{"$f":"IF(W11=\"\",\"\",VLOOKUP(W11,'11. Lists'!$F$47:$G$51,2,FALSE))","v":""},{"$nulls":3},{"$f":"IF(F11=\"\",\"\",F11)","v":""},{"$f":"IF(AB11=\"\",\"\",VLOOKUP(AB11,'11. Lists'!$F$36:$H$38,2,FALSE))","v":""},{"$f":"IF(AB11=\"\",\"\",VLOOKUP(AB11,'11. Lists'!$F$36:$H$38,3,FALSE))","v":""},{"$f":"IF(D11=\"\",\"\",((J11/1000)*V11*X11)*AD11)","v":""},{"$f":"IF(D11=\"\",\"\",((K11/1000)*V11*X11)*AD11)","v":""},{"$f":"IF(D11=\"\",\"\",M11)","v":""},{"$f":"IF(T11=\"\",\"\",VLOOKUP(T11,'11. Lists'!$B$47:$D$49,3,FALSE))","v":""},{"$f":"IF(D11=\"\",\"\",VLOOKUP(D11,'10. Condition and Temporal'!$B$6:$L$103,4,FALSE))","v":""}]
[null,2,"Hedgerows and Lines of trees",{"$nulls":8},{"$f":"IF(D12=\"\",\"\",IFERROR(IF(I12=\"\",\"\",((I12/1000)*V12*X12)*AD12),\"This intervention is not permitted within the SSM ▲\"))","v":""},{"$f":"IF(I12=\"\",\"\",IF(J12+K12>I12,\"Length Error ▲\",I12-J12-K12))","v":""},{"$f":"IFERROR(IF(I12=\"\",\"\",IF(M12=\"Length Error ▲\",\"Length Error ▲\",((M12/1000)*V12*X12)*AD12)),\"This intervention is not permitted within the SSM ▲\")","v":""},{"$nulls":5},{"$f":"IF(D12=\"\",\"\",VLOOKUP(D12,'9. All Habitats + Multipliers'!$C$4:$K$102,5,FALSE))","v":""},null,{"$f":"IF(T12=\"\",\"\",VLOOKUP(T12,'11. Lists'!$S$47:$U$50,2,FALSE))","v":""},{"$f":"IF(D12=\"\",\"\",VLOOKUP(D12,'10. Condition and Temporal'!$B$6:$C$103,2,FALSE))","v":""},{"$f":"IF(W12=\"\",\"\",VLOOKUP(W12,'11. Lists'!$F$47:$G$51,2,FALSE))","v":""},{"$nulls":3},{"$f":"IF(F12=\"\",\"\",F12)","v":""},{"$f":"IF(AB12=\"\",\"\",VLOOKUP(AB12,'11. Lists'!$F$36:$H$38,2,FALSE))","v":""},{"$f":"IF(AB12=\"\",\"\",VLOOKUP(AB12,'11. Lists'!$F$36:$H$38,3,FALSE))","v":""},{"$f":"IF(D12=\"\",\"\",((J12/1000)*V12*X12)*AD12)","v":""},{"$f":"IF(D12=\"\",\"\",((K12/1000)*V12*X12)*AD12)","v":""},{"$f":"IF(D12=\"\",\"\",M12)","v":""},{"$f":"IF(T12=\"\",\"\",VLOOKUP(T12,'11. Lists'!$B$47:$D$49,3,FALSE))","v":""},{"$f":"IF(D12=\"\",\"\",VLOOKUP(D12,'10. Condition and Temporal'!$B$6:$L$103,4,FALSE))","v":""}]
[null,3,"Hedgerows and Lines of trees",{"$nulls":8},"","","",{"$nulls":5},{"$f":"IF(D13=\"\",\"\",VLOOKUP(D13,'9. All Habitats + Multipliers'!$C$4:$K$102,5,FALSE))","v":""},null,{"$f":"IF(T13=\"\",\"\",VLOOKUP(T13,'11. Lists'!$S$47:$U$50,2,FALSE))","v":""},{"$f":"IF(D13=\"\",\"\",VLOOKUP(D13,'10. Condition and Temporal'!$B$6:$C$103,2,FALSE))","v":""},{"$f":"IF(W13=\"\",\"\",VLOOKUP(W13,'11. Lists'!$F$47:$G$51,2,FALSE))","v":""},{"$nulls":3},{"$f":"IF(F13=\"\",\"\",F13)","v":""},{"$f":"IF(AB13=\"\",\"\",VLOOKUP(AB13,'11. Lists'!$F$36:$H$38,2,FALSE))","v":""},{"$f":"IF(AB13=\"\",\"\",VLOOKUP(AB13,'11. Lists'!$F$36:$H$38,3,FALSE))","v":""},"","","",{"$f":"IF(T13=\"\",\"\",VLOOKUP(T13,'11. Lists'!$B$47:$D$49,3,FALSE))","v":""},{"$f":"IF(D13=\"\",\"\",VLOOKUP(D13,'10. Condition and Temporal'!$B$6:$L$103,4,FALSE))","v":""}]
[null,4,"Hedgerows and Lines of trees",{"$nulls":8},"","","",{"$nulls":5},{"$f":"IF(D14=\"\",\"\",VLOOKUP(D14,'9. All Habitats + Multipliers'!$C$4:$K$102,5,FALSE))","v":""},null,{"$f":"IF(T14=\"\",\"\",VLOOKUP(T14,'11. Lists'!$S$47:$U$50,2,FALSE))","v":""},{"$f":"IF(D14=\"\",\"\",VLOOKUP(D14,'10. Condition and Temporal'!$B$6:$C$103,2,FALSE))","v":""},{"$f":"IF(W14=\"\",\"\",VLOOKUP(W14,'11. Lists'!$F$47:$G$51,2,FALSE))","v":""},{"$nulls":3},"",{"$f":"IF(AB14=\"\",\"\",VLOOKUP(AB14,'11. Lists'!$F$36:$H$38,2,FALSE))","v":""},{"$f":"IF(AB14=\"\",\"\",VLOOKUP(AB14,'11. Lists'!$F$36:$H$38,3,FALSE))","v":""},"","","",{"$f":"IF(T14=\"\",\"\",VLOOKUP(T14,'11. Lists'!$B$47:$D$49,3,FALSE))","v":""},{"$f":"IF(D14=\"\",\"\",VLOOKUP(D14,'10. Condition and Temporal'!$B$6:$L$103,4,FALSE))","v":""}]
[null,5,"Hedgerows and Lines of trees",{"$nulls":8},"","","",{"$nulls":5},{"$f":"IF(D15=\"\",\"\",VLOOKUP(D15,'9. All Habitats + Multipliers'!$C$4:$K$102,5,FALSE))","v":""},null,{"$f":"IF(T15=\"\",\"\",VLOOKUP(T15,'11. Lists'!$S$47:$U$50,2,FALSE))","v":""},{"$f":"IF(D15=\"\",\"\",VLOOKUP(D15,'10. Condition and Temporal'!$B$6:$C$103,2,FALSE))","v":""},{"$f":"IF(W15=\"\",\"\",VLOOKUP(W15,'11. Lists'!$F$47:$G$51,2,FALSE))","v":""},{"$nulls":3},"",{"$f":"IF(AB15=\"\",\"\",VLOOKUP(AB15,'11. Lists'!$F$36:$H$38,2,FALSE))","v":""},{"$f":"IF(AB15=\"\",\"\",VLOOKUP(AB15,'11. Lists'!$F$36:$H$38,3,FALSE))","v":""},"","","",{"$f":"IF(T15=\"\",\"\",VLOOKUP(T15,'11. Lists'!$B$47:$D$49,3,FALSE))","v":""},{"$f":"IF(D15=\"\",\"\",VLOOKUP(D15,'10. Condition and Temporal'!$B$6:$L$103,4,FALSE))","v":""}]
[null,6,"Hedgerows and Lines of trees",{"$nulls":8},"","","",{"$nulls":5},{"$f":"IF(D16=\"\",\"\",VLOOKUP(D16,'9. All Habitats + Multipliers'!$C$4:$K$102,5,FALSE))","v":""},null,{"$f":"IF(T16=\"\",\"\",VLOOKUP(T16,'11. Lists'!$S$47:$U$50,2,FALSE))","v":""},{"$f":"IF(D16=\"\",\"\",VLOOKUP(D16,'10. Condition and Temporal'!$B$6:$C$103,2,FALSE))","v":""},{"$f":"IF(W16=\"\",\"\",VLOOKUP(W16,'11. Lists'!$F$47:$G$51,2,FALSE))","v":""},{"$nulls":3},"",{"$f":"IF(AB16=\"\",\"\",VLOOKUP(AB16,'11. Lists'!$F$36:$H$38,2,FALSE))","v":""},{"$f":"IF(AB16=\"\",\"\",VLOOKUP(AB16,'11. Lists'!$F$36:$H$38,3,FALSE))","v":""},"","","",{"$f":"IF(T16=\"\",\"\",VLOOKUP(T16,'11. Lists'!$B$47:$D$49,3,FALSE))","v":""},{"$f":"IF(D16=\"\",\"\",VLOOKUP(D16,'10. Condition and Temporal'!$B$6:$L$103,4,FALSE))","v":""}]
[null,7,"Hedgerows and Lines of trees",{"$nulls":8},"","","",{"$nulls":5},{"$f":"IF(D17=\"\",\"\",VLOOKUP(D17,'9. All Habitats + Multipliers'!$C$4:$K$102,5,FALSE))","v":""},null,{"$f":"IF(T17=\"\",\"\",VLOOKUP(T17,'11. Lists'!$S$47:$U$50,2,FALSE))","v":""},{"$f":"IF(D17=\"\",\"\",VLOOKUP(D17,'10. Condition and Temporal'!$B$6:$C$103,2,FALSE))","v":""},{"$f":"IF(W17=\"\",\"\",VLOOKUP(W17,'11. Lists'!$F$47:$G$51,2,FALSE))","v":""},{"$nulls":3},"",{"$f":"IF(AB17=\"\",\"\",VLOOKUP(AB17,'11. Lists'!$F$36:$H$38,2,FALSE))","v":""},{"$f":"IF(AB17=\"\",\"\",VLOOKUP(AB17,'11. Lists'!$F$36:$H$38,3,FALSE))","v":""},"","","",{"$f":"IF(T17=\"\",\"\",VLOOKUP(T17,'11. Lists'!$B$47:$D$49,3,FALSE))","v":""},{"$f":"IF(D17=\"\",\"\",VLOOKUP(D17,'10. Condition and Temporal'!$B$6:$L$103,4,FALSE))","v":""}]
[null,8,"Hedgerows and Lines of trees",{"$nulls":8},"","","",{"$nulls":5},{"$f":"IF(D18=\"\",\"\",VLOOKUP(D18,'9. All Habitats + Multipliers'!$C$4:$K$102,5,FALSE))","v":""},null,{"$f":"IF(T18=\"\",\"\",VLOOKUP(T18,'11. Lists'!$S$47:$U$50,2,FALSE))","v":""},{"$f":"IF(D18=\"\",\"\",VLOOKUP(D18,'10. Condition and Temporal'!$B$6:$C$103,2,FALSE))","v":""},{"$f":"IF(W18=\"\",\"\",VLOOKUP(W18,'11. Lists'!$F$47:$G$51,2,FALSE))","v":""},{"$nulls":3},"",{"$f":"IF(AB18=\"\",\"\",VLOOKUP(AB18,'11. Lists'!$F$36:$H$38,2,FALSE))","v":""},{"$f":"IF(AB18=\"\",\"\",VLOOKUP(AB18,'11. Lists'!$F$36:$H$38,3,FALSE))","v":""},"","","",{"$f":"IF(T18=\"\",\"\",VLOOKUP(T18,'11. Lists'!$B$47:$D$49,3,FALSE))","v":""},{"$f":"IF(D18=\"\",\"\",VLOOKUP(D18,'10. Condition and Temporal'!$B$6:$L$103,4,FALSE))","v":""}]
[null,9,"Hedgerows and Lines of trees",{"$nulls":8},"","","",{"$nulls":5},{"$f":"IF(D19=\"\",\"\",VLOOKUP(D19,'9. All Habitats + Multipliers'!$C$4:$K$102,5,FALSE))","v":""},null,{"$f":"IF(T19=\"\",\"\",VLOOKUP(T19,'11. Lists'!$S$47:$U$50,2,FALSE))","v":""},{"$f":"IF(D19=\"\",\"\",VLOOKUP(D19,'10. Condition and Temporal'!$B$6:$C$103,2,FALSE))","v":""},{"$f":"IF(W19=\"\",\"\",VLOOKUP(W19,'11. Lists'!$F$47:$G$51,2,FALSE))","v":""},{"$nulls":3},"",{"$f":"IF(AB19=\"\",\"\",VLOOKUP(AB19,'11. Lists'!$F$36:$H$38,2,FALSE))","v":""},{"$f":"IF(AB19=\"\",\"\",VLOOKUP(AB19,'11. Lists'!$F$36:$H$38,3,FALSE))","v":""},"","","",{"$f":"IF(T19=\"\",\"\",VLOOKUP(T19,'11. Lists'!$B$47:$D$49,3,FALSE))","v":""},{"$f":"IF(D19=\"\",\"\",VLOOKUP(D19,'10. Condition and Temporal'!$B$6:$L$103,4,FALSE))","v":""}]
[null,10,"Hedgerows and Lines of trees",{"$nulls":8},"","","",{"$nulls":5},{"$f":"IF(D20=\"\",\"\",VLOOKUP(D20,'9. All Habitats + Multipliers'!$C$4:$K$102,5,FALSE))","v":""},null,{"$f":"IF(T20=\"\",\"\",VLOOKUP(T20,'11. Lists'!$S$47:$U$50,2,FALSE))","v":""},{"$f":"IF(D20=\"\",\"\",VLOOKUP(D20,'10. Condition and Temporal'!$B$6:$C$103,2,FALSE))","v":""},{"$f":"IF(W20=\"\",\"\",VLOOKUP(W20,'11. Lists'!$F$47:$G$51,2,FALSE))","v":""},{"$nulls":3},"",{"$f":"IF(AB20=\"\",\"\",VLOOKUP(AB20,'11. Lists'!$F$36:$H$38,2,FALSE))","v":""},{"$f":"IF(AB20=\"\",\"\",VLOOKUP(AB20,'11. Lists'!$F$36:$H$38,3,FALSE))","v":""},"","","",{"$f":"IF(T20=\"\",\"\",VLOOKUP(T20,'11. Lists'!$B$47:$D$49,3,FALSE))","v":""},{"$f":"IF(D20=\"\",\"\",VLOOKUP(D20,'10. Condition and Temporal'!$B$6:$L$103,4,FALSE))","v":""}]
[null,11,"Hedgerows and Lines of trees",{"$nulls":8},"","","",{"$nulls":5},{"$f":"IF(D21=\"\",\"\",VLOOKUP(D21,'9. All Habitats + Multipliers'!$C$4:$K$102,5,FALSE))","v":""},null,{"$f":"IF(T21=\"\",\"\",VLOOKUP(T21,'11. Lists'!$S$47:$U$50,2,FALSE))","v":""},{"$f":"IF(D21=\"\",\"\",VLOOKUP(D21,'10. Condition and Temporal'!$B$6:$C$103,2,FALSE))","v":""},{"$f":"IF(W21=\"\",\"\",VLOOKUP(W21,'11. Lists'!$F$47:$G$51,2,FALSE))","v":""},{"$nulls":3},"",{"$f":"IF(AB21=\"\",\"\",VLOOKUP(AB21,'11. Lists'!$F$36:$H$38,2,FALSE))","v":""},{"$f":"IF(AB21=\"\",\"\",VLOOKUP(AB21,'11. Lists'!$F$36:$H$38,3,FALSE))","v":""},"","","",{"$f":"IF(T21=\"\",\"\",VLOOKUP(T21,'11. Lists'!$B$47:$D$49,3,FALSE))","v":""},{"$f":"IF(D21=\"\",\"\",VLOOKUP(D21,'10. Condition and Temporal'!$B$6:$L$103,4,FALSE))","v":""}]
[null,12,"Hedgerows and Lines of trees",{"$nulls":8},"","","",{"$nulls":5},{"$f":"IF(D22=\"\",\"\",VLOOKUP(D22,'9. All Habitats + Multipliers'!$C$4:$K$102,5,FALSE))","v":""},null,{"$f":"IF(T22=\"\",\"\",VLOOKUP(T22,'11. Lists'!$S$47:$U$50,2,FALSE))","v":""},{"$f":"IF(D22=\"\",\"\",VLOOKUP(D22,'10. Condition and Temporal'!$B$6:$C$103,2,FALSE))","v":""},{"$f":"IF(W22=\"\",\"\",VLOOKUP(W22,'11. Lists'!$F$47:$G$51,2,FALSE))","v":""},{"$nulls":3},"",{"$f":"IF(AB22=\"\",\"\",VLOOKUP(AB22,'11. Lists'!$F$36:$H$38,2,FALSE))","v":""},{"$f":"IF(AB22=\"\",\"\",VLOOKUP(AB22,'11. Lists'!$F$36:$H$38,3,FALSE))","v":""},"","","",{"$f":"IF(T22=\"\",\"\",VLOOKUP(T22,'11. Lists'!$B$47:$D$49,3,FALSE))","v":""},{"$f":"IF(D22=\"\",\"\",VLOOKUP(D22,'10. Condition and Temporal'!$B$6:$L$103,4,FALSE))","v":""}]
[null,13,"Hedgerows and Lines of trees",{"$nulls":8},"","","",{"$nulls":5},{"$f":"IF(D23=\"\",\"\",VLOOKUP(D23,'9. All Habitats + Multipliers'!$C$4:$K$102,5,FALSE))","v":""},null,{"$f":"IF(T23=\"\",\"\",VLOOKUP(T23,'11. Lists'!$S$47:$U$50,2,FALSE))","v":""},{"$f":"IF(D23=\"\",\"\",VLOOKUP(D23,'10. Condition and Temporal'!$B$6:$C$103,2,FALSE))","v":""},{"$f":"IF(W23=\"\",\"\",VLOOKUP(W23,'11. Lists'!$F$47:$G$51,2,FALSE))","v":""},{"$nulls":3},"",{"$f":"IF(AB23=\"\",\"\",VLOOKUP(AB23,'11. Lists'!$F$36:$H$38,2,FALSE))","v":""},{"$f":"IF(AB23=\"\",\"\",VLOOKUP(AB23,'11. Lists'!$F$36:$H$38,3,FALSE))","v":""},"","","",{"$f":"IF(T23=\"\",\"\",VLOOKUP(T23,'11. Lists'!$B$47:$D$49,3,FALSE))","v":""},{"$f":"IF(D23=\"\",\"\",VLOOKUP(D23,'10. Condition and Temporal'!$B$6:$L$103,4,FALSE))","v":""}]
[null,14,"Hedgerows and Lines of trees",{"$nulls":8},"","","",{"$nulls":5},{"$f":"IF(D24=\"\",\"\",VLOOKUP(D24,'9. All Habitats + Multipliers'!$C$4:$K$102,5,FALSE))","v":""},null,{"$f":"IF(T24=\"\",\"\",VLOOKUP(T24,'11. Lists'!$S$47:$U$50,2,FALSE))","v":""},{"$f":"IF(D24=\"\",\"\",VLOOKUP(D24,'10. Condition and Temporal'!$B$6:$C$103,2,FALSE))","v":""},{"$f":"IF(W24=\"\",\"\",VLOOKUP(W24,'11. Lists'!$F$47:$G$51,2,FALSE))","v":""},{"$nulls":3},"",{"$f":"IF(AB24=\"\",\"\",VLOOKUP(AB24,'11. Lists'!$F$36:$H$38,2,FALSE))","v":""},{"$f":"IF(AB24=\"\",\"\",VLOOKUP(AB24,'11. Lists'!$F$36:$H$38,3,FALSE))","v":""},"","","",{"$f":"IF(T24=\"\",\"\",VLOOKUP(T24,'11. Lists'!$B$47:$D$49,3,FALSE))","v":""},{"$f":"IF(D24=\"\",\"\",VLOOKUP(D24,'10. Condition and Temporal'!$B$6:$L$103,4,FALSE))","v":""}]
[null,15,"Hedgerows and Lines of trees",{"$nulls":8},"","","",{"$nulls":5},{"$f":"IF(D25=\"\",\"\",VLOOKUP(D25,'9. All Habitats + Multipliers'!$C$4:$K$102,5,FALSE))","v":""},null,{"$f":"IF(T25=\"\",\"\",VLOOKUP(T25,'11. Lists'!$S$47:$U$50,2,FALSE))","v":""},{"$f":"IF(D25=\"\",\"\",VLOOKUP(D25,'10. Condition and Temporal'!$B$6:$C$103,2,FALSE))","v":""},{"$f":"IF(W25=\"\",\"\",VLOOKUP(W25,'11. Lists'!$F$47:$G$51,2,FALSE))","v":""},{"$nulls":3},"",{"$f":"IF(AB25=\"\",\"\",VLOOKUP(AB25,'11. Lists'!$F$36:$H$38,2,FALSE))","v":""},{"$f":"IF(AB25=\"\",\"\",VLOOKUP(AB25,'11. Lists'!$F$36:$H$38,3,FALSE))","v":""},"","","",{"$f":"IF(T25=\"\",\"\",VLOOKUP(T25,'11. Lists'!$B$47:$D$49,3,FALSE))","v":""},{"$f":"IF(D25=\"\",\"\",VLOOKUP(D25,'10. Condition and Temporal'!$B$6:$L$103,4,FALSE))","v":""}]
[null,16,"Hedgerows and Lines of trees",{"$nulls":8},"","","",{"$nulls":5},{"$f":"IF(D26=\"\",\"\",VLOOKUP(D26,'9. All Habitats + Multipliers'!$C$4:$K$102,5,FALSE))","v":""},null,{"$f":"IF(T26=\"\",\"\",VLOOKUP(T26,'11. Lists'!$S$47:$U$50,2,FALSE))","v":""},{"$f":"IF(D26=\"\",\"\",VLOOKUP(D26,'10. Condition and Temporal'!$B$6:$C$103,2,FALSE))","v":""},{"$f":"IF(W26=\"\",\"\",VLOOKUP(W26,'11. Lists'!$F$47:$G$51,2,FALSE))","v":""},{"$nulls":3},"",{"$f":"IF(AB26=\"\",\"\",VLOOKUP(AB26,'11. Lists'!$F$36:$H$38,2,FALSE))","v":""},{"$f":"IF(AB26=\"\",\"\",VLOOKUP(AB26,'11. Lists'!$F$36:$H$38,3,FALSE))","v":""},"","","",{"$f":"IF(T26=\"\",\"\",VLOOKUP(T26,'11. Lists'!$B$47:$D$49,3,FALSE))","v":""},{"$f":"IF(D26=\"\",\"\",VLOOKUP(D26,'10. Condition and Temporal'!$B$6:$L$103,4,FALSE))","v":""}]
[null,17,"Hedgerows and Lines of trees",{"$nulls":8},"","","",{"$nulls":5},{"$f":"IF(D27=\"\",\"\",VLOOKUP(D27,'9. All Habitats + Multipliers'!$C$4:$K$102,5,FALSE))","v":""},null,{"$f":"IF(T27=\"\",\"\",VLOOKUP(T27,'11. Lists'!$S$47:$U$50,2,FALSE))","v":""},{"$f":"IF(D27=\"\",\"\",VLOOKUP(D27,'10. Condition and Temporal'!$B$6:$C$103,2,FALSE))","v":""},{"$f":"IF(W27=\"\",\"\",VLOOKUP(W27,'11. Lists'!$F$47:$G$51,2,FALSE))","v":""},{"$nulls":3},"",{"$f":"IF(AB27=\"\",\"\",VLOOKUP(AB27,'11. Lists'!$F$36:$H$38,2,FALSE))","v":""},{"$f":"IF(AB27=\"\",\"\",VLOOKUP(AB27,'11. Lists'!$F$36:$H$38,3,FALSE))","v":""},"","","",{"$f":"IF(T27=\"\",\"\",VLOOKUP(T27,'11. Lists'!$B$47:$D$49,3,FALSE))","v":""},{"$f":"IF(D27=\"\",\"\",VLOOKUP(D27,'10. Condition and Temporal'!$B$6:$L$103,4,FALSE))","v":""}]
[null,18,"Hedgerows and Lines of trees",{"$nulls":8},"","","",{"$nulls":5},{"$f":"IF(D28=\"\",\"\",VLOOKUP(D28,'9. All Habitats + Multipliers'!$C$4:$K$102,5,FALSE))","v":""},null,{"$f":"IF(T28=\"\",\"\",VLOOKUP(T28,'11. Lists'!$S$47:$U$50,2,FALSE))","v":""},{"$f":"IF(D28=\"\",\"\",VLOOKUP(D28,'10. Condition and Temporal'!$B$6:$C$103,2,FALSE))","v":""},{"$f":"IF(W28=\"\",\"\",VLOOKUP(W28,'11. Lists'!$F$47:$G$51,2,FALSE))","v":""},{"$nulls":3},"",{"$f":"IF(AB28=\"\",\"\",VLOOKUP(AB28,'11. Lists'!$F$36:$H$38,2,FALSE))","v":""},{"$f":"IF(AB28=\"\",\"\",VLOOKUP(AB28,'11. Lists'!$F$36:$H$38,3,FALSE))","v":""},"","","",{"$f":"IF(T28=\"\",\"\",VLOOKUP(T28,'11. Lists'!$B$47:$D$49,3,FALSE))","v":""},{"$f":"IF(D28=\"\",\"\",VLOOKUP(D28,'10. Condition and Temporal'!$B$6:$L$103,4,FALSE))","v":""}]
[null,19,"Hedgerows and Lines of trees",{"$nulls":8},"","","",{"$nulls":5},{"$f":"IF(D29=\"\",\"\",VLOOKUP(D29,'9. All Habitats + Multipliers'!$C$4:$K$102,5,FALSE))","v":""},null,{"$f":"IF(T29=\"\",\"\",VLOOKUP(T29,'11. Lists'!$S$47:$U$50,2,FALSE))","v":""},{"$f":"IF(D29=\"\",\"\",VLOOKUP(D29,'10. Condition and Temporal'!$B$6:$C$103,2,FALSE))","v":""},{"$f":"IF(W29=\"\",\"\",VLOOKUP(W29,'11. Lists'!$F$47:$G$51,2,FALSE))","v":""},{"$nulls":3},"",{"$f":"IF(AB29=\"\",\"\",VLOOKUP(AB29,'11. Lists'!$F$36:$H$38,2,FALSE))","v":""},{"$f":"IF(AB29=\"\",\"\",VLOOKUP(AB29,'11. Lists'!$F$36:$H$38,3,FALSE))","v":""},"","","",{"$f":"IF(T29=\"\",\"\",VLOOKUP(T29,'11. Lists'!$B$47:$D$49,3,FALSE))","v":""},{"$f":"IF(D29=\"\",\"\",VLOOKUP(D29,'10. Condition and Temporal'!$B$6:$L$103,4,FALSE))","v":""}]
[null,20,"Hedgerows and Lines of trees",{"$nulls":8},"","","",{"$nulls":5},{"$f":"IF(D30=\"\",\"\",VLOOKUP(D30,'9. All Habitats + Multipliers'!$C$4:$K$102,5,FALSE))","v":""},null,{"$f":"IF(T30=\"\",\"\",VLOOKUP(T30,'11. Lists'!$S$47:$U$50,2,FALSE))","v":""},{"$f":"IF(D30=\"\",\"\",VLOOKUP(D30,'10. Condition and Temporal'!$B$6:$C$103,2,FALSE))","v":""},{"$f":"IF(W30=\"\",\"\",VLOOKUP(W30,'11. Lists'!$F$47:$G$51,2,FALSE))","v":""},{"$nulls":3},"",{"$f":"IF(AB30=\"\",\"\",VLOOKUP(AB30,'11. Lists'!$F$36:$H$38,2,FALSE))","v":""},{"$f":"IF(AB30=\"\",\"\",VLOOKUP(AB30,'11. Lists'!$F$36:$H$38,3,FALSE))","v":""},"","","",{"$f":"IF(T30=\"\",\"\",VLOOKUP(T30,'11. Lists'!$B$47:$D$49,3,FALSE))","v":""},{"$f":"IF(D30=\"\",\"\",VLOOKUP(D30,'10. Condition and Temporal'!$B$6:$L$103,4,FALSE))","v":""}]
[{"$nulls":7},"Totals",{"$f":"SUM(I11:I30)","v":{"v":0,"d":"0.00"}},{"v":0,"d":"0.00"},{"v":0,"d":"0.00"},{"v":0,"d":"0.0000"},{"v":0,"d":"0.00"},{"v":0,"d":"0.0000"}]
[{"$nulls":7},"Error Check 1",{"$f":"IF(I31<J31+K31,\"Error - Lengths Retained and Enhanced Exceed Total Length ▲\",\"Lengths Acceptable ✓\")","v":"Lengths Acceptable ✓"},{"$nulls":5},{"$f":"IFERROR(FIND(\"Error\",I32),0)","v":0}]
[{"$nulls":7},"Error Check 2",{"$f":"IF(I31<5000,\"Lengths Acceptable ✓\",IF(I31>=5000,\"Length Exceeds Length Appropriate for Small Sites Metric ▲\"))","v":"Lengths Acceptable ✓"},{"$nulls":5},{"$f":"COUNTIF(L11:N30,\"*\"&\"error\"&\"*\")","v":0}]
[{"$nulls":17},"Data beyond this column is automated"]
[null,"1b. Habitats to be created"]
[]
[null,"Ref",null,null,"Condition Assessment",null,null,"D. Strategic significance","E. Total Length created (m)",null,null,"Units created on-site",null,null,"Comments",{"$nulls":4},"Habitat distinctiveness",null,null,"Habitat condition",{"$nulls":4},"Strategic significance",null,null,"Temporal multiplier",null,"Difficulty multipliers"]
[null,null,"A. Broad Habitat","B. Habitat type","Acceptable condition options","C. Targeted condition",{"$nulls":8},"User comments","LPA comments",{"$nulls":3},"Distinctiveness",null,"Score","Condition ","Score",{"$nulls":3},"Strategic significance","Strategic significance","Strategic significance multiplier","Time to target condition/years","Time to target multiplier","Difficulty of creation category","Difficulty of creation multiplier"]
[null,1,"Hedgerows and Lines of trees","Native hedgerow",{"$f":"IF(D39=\"\",\"\",VLOOKUP(D39,'10. Condition and Temporal'!$B$6:$D$103,3,FALSE))","v":"Moderate, Good"},"Good",null,"Area/compensation not in local strategy/ no local strategy",{"v":6,"d":"6.00"},null,null,{"$f":"IF(D39=\"\",\"\",IFERROR(IF(I39=\"\",\"\",((I39/1000)*(V39*X39))*(AH39*AF39)*AD39),\"This intervention is not permitted within the SSM ▲\"))","v":{"v":0.023476332985200004,"d":"0.0235"}},null,null,"Fill gaps in hedgerow",{"$nulls":4},{"$f":"IF(D39=\"\",\"\",VLOOKUP(D39,'9. All Habitats + Multipliers'!$C$4:$K$102,5,FALSE))","v":"Low"},null,{"$f":"IF(T39=\"\",\"\",VLOOKUP(T39,'11. Lists'!$S$47:$U$50,2,FALSE))","v":2},{"$f":"IF(F39=\"\",\"\",F39)","v":"Good"},{"$f":"IF(W39=\"\",\"\",VLOOKUP(W39,'11. Lists'!$F$47:$G$51,2,FALSE))","v":3},{"$nulls":3},{"$f":"IF(H39=\"\",\"\",H39)","v":"Area/compensation not in local strategy/ no local strategy"},{"$f":"IF(AB39=\"\",\"\",VLOOKUP(AB39,'11. Lists'!$F$36:$H$38,2,FALSE))","v":"Low Strategic Significance"},{"$f":"IF(AB39=\"\",\"\",VLOOKUP(AB39,'11. Lists'!$F$36:$H$38,3,FALSE))","v":1},{"$f":"IF(F39=\"\",\"\",IF(F39=\"Moderate\",VLOOKUP(D39,'10. Condition and Temporal'!$B$6:$L$103,6,FALSE),IF(F39=\"Good\",VLOOKUP(D39,'10. Condition and Temporal'!$B$6:$L$103,7,FALSE),IF(F39=\"Poor\",VLOOKUP(D39,'10. Condition and Temporal'!$B$6:$L$103,8,FALSE),IF(F39=\"Condition Assessment N/A\",VLOOKUP(D39,'10. Condition and Temporal'!$B$6:$L$103,9,FALSE),IF(F39=\"N/A - Other\",VLOOKUP(D39,'10. Condition and Temporal'!$B$6:$L$103,10,FALSE)))))))","v":12},{"$f":"IF(AE39=\"\",\"\",VLOOKUP(AE39,'11. Lists'!$I$47:$K$80,3,FALSE))","v":{"v":0.6521203607,"d":"0.652"}},{"$f":"IF(D39=\"\",\"\",VLOOKUP(D39,'9. All Habitats + Multipliers'!$C$4:$K$102,7,FALSE))","v":"Low"},{"$f":"IF(AG39=\"\",\"\",VLOOKUP(AG39,'11. Lists'!$J$35:$K$38,2,FALSE))","v":1}]
[null,2,"Hedgerows and Lines of trees","Native hedgerow",{"$f":"IF(D40=\"\",\"\",VLOOKUP(D40,'10. Condition and Temporal'!$B$6:$D$103,3,FALSE))","v":"Moderate, Good"},"Good",null,"Area/compensation not in local strategy/ no local strategy",{"v":7,"d":"7.00"},null,null,{"$f":"IF(D40=\"\",\"\",IFERROR(IF(I40=\"\",\"\",((I40/1000)*(V40*X40))*(AH40*AF40)*AD40),\"This intervention is not permitted within the SSM ▲\"))","v":{"v":0.027389055149400002,"d":"0.0274"}},null,null,"New north boundary hedgerow",{"$nulls":4},{"$f":"IF(D40=\"\",\"\",VLOOKUP(D40,'9. All Habitats + Multipliers'!$C$4:$K$102,5,FALSE))","v":"Low"},null,{"$f":"IF(T40=\"\",\"\",VLOOKUP(T40,'11. Lists'!$S$47:$U$50,2,FALSE))","v":2},{"$f":"IF(F40=\"\",\"\",F40)","v":"Good"},{"$f":"IF(W40=\"\",\"\",VLOOKUP(W40,'11. Lists'!$F$47:$G$51,2,FALSE))","v":3},{"$nulls":3},{"$f":"IF(H40=\"\",\"\",H40)","v":"Area/compensation not in local strategy/ no local strategy"},{"$f":"IF(AB40=\"\",\"\",VLOOKUP(AB40,'11. Lists'!$F$36:$H$38,2,FALSE))","v":"Low Strategic Significance"},{"$f":"IF(AB40=\"\",\"\",VLOOKUP(AB40,'11. Lists'!$F$36:$H$38,3,FALSE))","v":1},{"$f":"IF(F40=\"\",\"\",IF(F40=\"Moderate\",VLOOKUP(D40,'10. Condition and Temporal'!$B$6:$L$103,6,FALSE),IF(F40=\"Good\",VLOOKUP(D40,'10. Condition and Temporal'!$B$6:$L$103,7,FALSE),IF(F40=\"Poor\",VLOOKUP(D40,'10. Condition and Temporal'!$B$6:$L$103,8,FALSE),IF(F40=\"Condition Assessment N/A\",VLOOKUP(D40,'10. Condition and Temporal'!$B$6:$L$103,9,FALSE),IF(F40=\"N/A - Other\",VLOOKUP(D40,'10. Condition and Temporal'!$B$6:$L$103,10,FALSE)))))))","v":12},{"$f":"IF(AE40=\"\",\"\",VLOOKUP(AE40,'11. Lists'!$I$47:$K$80,3,FALSE))","v":{"v":0.6521203607,"d":"0.652"}},{"$f":"IF(D40=\"\",\"\",VLOOKUP(D40,'9. All Habitats + Multipliers'!$C$4:$K$102,7,FALSE))","v":"Low"},{"$f":"IF(AG40=\"\",\"\",VLOOKUP(AG40,'11. Lists'!$J$35:$K$38,2,FALSE))","v":1}]
[null,3,"Hedgerows and Lines of trees",null,{"$f":"IF(D41=\"\",\"\",VLOOKUP(D41,'10. Condition and Temporal'!$B$6:$D$103,3,FALSE))","v":""},{"$nulls":6},"",{"$nulls":7},{"$f":"IF(D41=\"\",\"\",VLOOKUP(D41,'9. All Habitats + Multipliers'!$C$4:$K$102,5,FALSE))","v":""},null,{"$f":"IF(T41=\"\",\"\",VLOOKUP(T41,'11. Lists'!$S$47:$U$50,2,FALSE))","v":""},{"$f":"IF(F41=\"\",\"\",F41)","v":""},{"$f":"IF(W41=\"\",\"\",VLOOKUP(W41,'11. Lists'!$F$47:$G$51,2,FALSE))","v":""},{"$nulls":3},"",{"$f":"IF(AB41=\"\",\"\",VLOOKUP(AB41,'11. Lists'!$F$36:$H$38,2,FALSE))","v":""},{"$f":"IF(AB41=\"\",\"\",VLOOKUP(AB41,'11. Lists'!$F$36:$H$38,3,FALSE))","v":""},{"$f":"IF(F41=\"\",\"\",IF(F41=\"Moderate\",VLOOKUP(D41,'10. Condition and Temporal'!$B$6:$L$103,6,FALSE),IF(F41=\"Good\",VLOOKUP(D41,'10. Condition and Temporal'!$B$6:$L$103,7,FALSE),IF(F41=\"Poor\",VLOOKUP(D41,'10. Condition and Temporal'!$B$6:$L$103,8,FALSE),IF(F41=\"Condition Assessment N/A\",VLOOKUP(D41,'10. Condition and Temporal'!$B$6:$L$103,9,FALSE),IF(F41=\"N/A - Other\",VLOOKUP(D41,'10. Condition and Temporal'!$B$6:$L$103,10,FALSE)))))))","v":""},{"$f":"IF(AE41=\"\",\"\",VLOOKUP(AE41,'11. Lists'!$I$47:$K$80,3,FALSE))","v":""},{"$f":"IF(D41=\"\",\"\",VLOOKUP(D41,'9. All Habitats + Multipliers'!$C$4:$K$102,7,FALSE))","v":""},{"$f":"IF(AG41=\"\",\"\",VLOOKUP(AG41,'11. Lists'!$J$35:$K$38,2,FALSE))","v":""}]
[null,4,"Hedgerows and Lines of trees",null,{"$f":"IF(D42=\"\",\"\",VLOOKUP(D42,'10. Condition and Temporal'!$B$6:$D$103,3,FALSE))","v":""},{"$nulls":6},"",{"$nulls":7},{"$f":"IF(D42=\"\",\"\",VLOOKUP(D42,'9. All Habitats + Multipliers'!$C$4:$K$102,5,FALSE))","v":""},null,{"$f":"IF(T42=\"\",\"\",VLOOKUP(T42,'11. Lists'!$S$47:$U$50,2,FALSE))","v":""},{"$f":"IF(F42=\"\",\"\",F42)","v":""},{"$f":"IF(W42=\"\",\"\",VLOOKUP(W42,'11. Lists'!$F$47:$G$51,2,FALSE))","v":""},{"$nulls":3},"",{"$f":"IF(AB42=\"\",\"\",VLOOKUP(AB42,'11. Lists'!$F$36:$H$38,2,FALSE))","v":""},{"$f":"IF(AB42=\"\",\"\",VLOOKUP(AB42,'11. Lists'!$F$36:$H$38,3,FALSE))","v":""},{"$f":"IF(F42=\"\",\"\",IF(F42=\"Moderate\",VLOOKUP(D42,'10. Condition and Temporal'!$B$6:$L$103,6,FALSE),IF(F42=\"Good\",VLOOKUP(D42,'10. Condition and Temporal'!$B$6:$L$103,7,FALSE),IF(F42=\"Poor\",VLOOKUP(D42,'10. Condition and Temporal'!$B$6:$L$103,8,FALSE),IF(F42=\"Condition Assessment N/A\",VLOOKUP(D42,'10. Condition and Temporal'!$B$6:$L$103,9,FALSE),IF(F42=\"N/A - Other\",VLOOKUP(D42,'10. Condition and Temporal'!$B$6:$L$103,10,FALSE)))))))","v":""},{"$f":"IF(AE42=\"\",\"\",VLOOKUP(AE42,'11. Lists'!$I$47:$K$80,3,FALSE))","v":""},{"$f":"IF(D42=\"\",\"\",VLOOKUP(D42,'9. All Habitats + Multipliers'!$C$4:$K$102,7,FALSE))","v":""},{"$f":"IF(AG42=\"\",\"\",VLOOKUP(AG42,'11. Lists'!$J$35:$K$38,2,FALSE))","v":""}]
[null,5,"Hedgerows and Lines of trees",null,{"$f":"IF(D43=\"\",\"\",VLOOKUP(D43,'10. Condition and Temporal'!$B$6:$D$103,3,FALSE))","v":""},{"$nulls":6},"",{"$nulls":7},{"$f":"IF(D43=\"\",\"\",VLOOKUP(D43,'9. All Habitats + Multipliers'!$C$4:$K$102,5,FALSE))","v":""},null,{"$f":"IF(T43=\"\",\"\",VLOOKUP(T43,'11. Lists'!$S$47:$U$50,2,FALSE))","v":""},{"$f":"IF(F43=\"\",\"\",F43)","v":""},{"$f":"IF(W43=\"\",\"\",VLOOKUP(W43,'11. Lists'!$F$47:$G$51,2,FALSE))","v":""},{"$nulls":3},"",{"$f":"IF(AB43=\"\",\"\",VLOOKUP(AB43,'11. Lists'!$F$36:$H$38,2,FALSE))","v":""},{"$f":"IF(AB43=\"\",\"\",VLOOKUP(AB43,'11. Lists'!$F$36:$H$38,3,FALSE))","v":""},{"$f":"IF(F43=\"\",\"\",IF(F43=\"Moderate\",VLOOKUP(D43,'10. Condition and Temporal'!$B$6:$L$103,6,FALSE),IF(F43=\"Good\",VLOOKUP(D43,'10. Condition and Temporal'!$B$6:$L$103,7,FALSE),IF(F43=\"Poor\",VLOOKUP(D43,'10. Condition and Temporal'!$B$6:$L$103,8,FALSE),IF(F43=\"Condition Assessment N/A\",VLOOKUP(D43,'10. Condition and Temporal'!$B$6:$L$103,9,FALSE),IF(F43=\"N/A - Other\",VLOOKUP(D43,'10. Condition and Temporal'!$B$6:$L$103,10,FALSE)))))))","v":""},{"$f":"IF(AE43=\"\",\"\",VLOOKUP(AE43,'11. Lists'!$I$47:$K$80,3,FALSE))","v":""},{"$f":"IF(D43=\"\",\"\",VLOOKUP(D43,'9. All Habitats + Multipliers'!$C$4:$K$102,7,FALSE))","v":""},{"$f":"IF(AG43=\"\",\"\",VLOOKUP(AG43,'11. Lists'!$J$35:$K$38,2,FALSE))","v":""}]
[null,6,"Hedgerows and Lines of trees",null,{"$f":"IF(D44=\"\",\"\",VLOOKUP(D44,'10. Condition and Temporal'!$B$6:$D$103,3,FALSE))","v":""},{"$nulls":6},"",{"$nulls":7},{"$f":"IF(D44=\"\",\"\",VLOOKUP(D44,'9. All Habitats + Multipliers'!$C$4:$K$102,5,FALSE))","v":""},null,{"$f":"IF(T44=\"\",\"\",VLOOKUP(T44,'11. Lists'!$S$47:$U$50,2,FALSE))","v":""},"",{"$f":"IF(W44=\"\",\"\",VLOOKUP(W44,'11. Lists'!$F$47:$G$51,2,FALSE))","v":""},{"$nulls":3},"",{"$f":"IF(AB44=\"\",\"\",VLOOKUP(AB44,'11. Lists'!$F$36:$H$38,2,FALSE))","v":""},{"$f":"IF(AB44=\"\",\"\",VLOOKUP(AB44,'11. Lists'!$F$36:$H$38,3,FALSE))","v":""},{"$f":"IF(F44=\"\",\"\",IF(F44=\"Moderate\",VLOOKUP(D44,'10. Condition and Temporal'!$B$6:$L$103,6,FALSE),IF(F44=\"Good\",VLOOKUP(D44,'10. Condition and Temporal'!$B$6:$L$103,7,FALSE),IF(F44=\"Poor\",VLOOKUP(D44,'10. Condition and Temporal'!$B$6:$L$103,8,FALSE),IF(F44=\"Condition Assessment N/A\",VLOOKUP(D44,'10. Condition and Temporal'!$B$6:$L$103,9,FALSE),IF(F44=\"N/A - Other\",VLOOKUP(D44,'10. Condition and Temporal'!$B$6:$L$103,10,FALSE)))))))","v":""},{"$f":"IF(AE44=\"\",\"\",VLOOKUP(AE44,'11. Lists'!$I$47:$K$80,3,FALSE))","v":""},{"$f":"IF(D44=\"\",\"\",VLOOKUP(D44,'9. All Habitats + Multipliers'!$C$4:$K$102,7,FALSE))","v":""},{"$f":"IF(AG44=\"\",\"\",VLOOKUP(AG44,'11. Lists'!$J$35:$K$38,2,FALSE))","v":""}]
[null,7,"Hedgerows and Lines of trees",null,{"$f":"IF(D45=\"\",\"\",VLOOKUP(D45,'10. Condition and Temporal'!$B$6:$D$103,3,FALSE))","v":""},{"$nulls":6},"",{"$nulls":7},{"$f":"IF(D45=\"\",\"\",VLOOKUP(D45,'9. All Habitats + Multipliers'!$C$4:$K$102,5,FALSE))","v":""},null,{"$f":"IF(T45=\"\",\"\",VLOOKUP(T45,'11. Lists'!$S$47:$U$50,2,FALSE))","v":""},"",{"$f":"IF(W45=\"\",\"\",VLOOKUP(W45,'11. Lists'!$F$47:$G$51,2,FALSE))","v":""},{"$nulls":3},"",{"$f":"IF(AB45=\"\",\"\",VLOOKUP(AB45,'11. Lists'!$F$36:$H$38,2,FALSE))","v":""},{"$f":"IF(AB45=\"\",\"\",VLOOKUP(AB45,'11. Lists'!$F$36:$H$38,3,FALSE))","v":""},{"$f":"IF(F45=\"\",\"\",IF(F45=\"Moderate\",VLOOKUP(D45,'10. Condition and Temporal'!$B$6:$L$103,6,FALSE),IF(F45=\"Good\",VLOOKUP(D45,'10. Condition and Temporal'!$B$6:$L$103,7,FALSE),IF(F45=\"Poor\",VLOOKUP(D45,'10. Condition and Temporal'!$B$6:$L$103,8,FALSE),IF(F45=\"Condition Assessment N/A\",VLOOKUP(D45,'10. Condition and Temporal'!$B$6:$L$103,9,FALSE),IF(F45=\"N/A - Other\",VLOOKUP(D45,'10. Condition and Temporal'!$B$6:$L$103,10,FALSE)))))))","v":""},{"$f":"IF(AE45=\"\",\"\",VLOOKUP(AE45,'11. Lists'!$I$47:$K$80,3,FALSE))","v":""},{"$f":"IF(D45=\"\",\"\",VLOOKUP(D45,'9. All Habitats + Multipliers'!$C$4:$K$102,7,FALSE))","v":""},{"$f":"IF(AG45=\"\",\"\",VLOOKUP(AG45,'11. Lists'!$J$35:$K$38,2,FALSE))","v":""}]
[null,8,"Hedgerows and Lines of trees",null,{"$f":"IF(D46=\"\",\"\",VLOOKUP(D46,'10. Condition and Temporal'!$B$6:$D$103,3,FALSE))","v":""},{"$nulls":6},"",{"$nulls":7},{"$f":"IF(D46=\"\",\"\",VLOOKUP(D46,'9. All Habitats + Multipliers'!$C$4:$K$102,5,FALSE))","v":""},null,{"$f":"IF(T46=\"\",\"\",VLOOKUP(T46,'11. Lists'!$S$47:$U$50,2,FALSE))","v":""},"",{"$f":"IF(W46=\"\",\"\",VLOOKUP(W46,'11. Lists'!$F$47:$G$51,2,FALSE))","v":""},{"$nulls":3},"",{"$f":"IF(AB46=\"\",\"\",VLOOKUP(AB46,'11. Lists'!$F$36:$H$38,2,FALSE))","v":""},{"$f":"IF(AB46=\"\",\"\",VLOOKUP(AB46,'11. Lists'!$F$36:$H$38,3,FALSE))","v":""},{"$f":"IF(F46=\"\",\"\",IF(F46=\"Moderate\",VLOOKUP(D46,'10. Condition and Temporal'!$B$6:$L$103,6,FALSE),IF(F46=\"Good\",VLOOKUP(D46,'10. Condition and Temporal'!$B$6:$L$103,7,FALSE),IF(F46=\"Poor\",VLOOKUP(D46,'10. Condition and Temporal'!$B$6:$L$103,8,FALSE),IF(F46=\"Condition Assessment N/A\",VLOOKUP(D46,'10. Condition and Temporal'!$B$6:$L$103,9,FALSE),IF(F46=\"N/A - Other\",VLOOKUP(D46,'10. Condition and Temporal'!$B$6:$L$103,10,FALSE)))))))","v":""},{"$f":"IF(AE46=\"\",\"\",VLOOKUP(AE46,'11. Lists'!$I$47:$K$80,3,FALSE))","v":""},{"$f":"IF(D46=\"\",\"\",VLOOKUP(D46,'9. All Habitats + Multipliers'!$C$4:$K$102,7,FALSE))","v":""},{"$f":"IF(AG46=\"\",\"\",VLOOKUP(AG46,'11. Lists'!$J$35:$K$38,2,FALSE))","v":""}]
[null,9,"Hedgerows and Lines of trees",null,{"$f":"IF(D47=\"\",\"\",VLOOKUP(D47,'10. Condition and Temporal'!$B$6:$D$103,3,FALSE))","v":""},{"$nulls":6},"",{"$nulls":7},{"$f":"IF(D47=\"\",\"\",VLOOKUP(D47,'9. All Habitats + Multipliers'!$C$4:$K$102,5,FALSE))","v":""},null,{"$f":"IF(T47=\"\",\"\",VLOOKUP(T47,'11. Lists'!$S$47:$U$50,2,FALSE))","v":""},"",{"$f":"IF(W47=\"\",\"\",VLOOKUP(W47,'11. Lists'!$F$47:$G$51,2,FALSE))","v":""},{"$nulls":3},"",{"$f":"IF(AB47=\"\",\"\",VLOOKUP(AB47,'11. Lists'!$F$36:$H$38,2,FALSE))","v":""},{"$f":"IF(AB47=\"\",\"\",VLOOKUP(AB47,'11. Lists'!$F$36:$H$38,3,FALSE))","v":""},{"$f":"IF(F47=\"\",\"\",IF(F47=\"Moderate\",VLOOKUP(D47,'10. Condition and Temporal'!$B$6:$L$103,6,FALSE),IF(F47=\"Good\",VLOOKUP(D47,'10. Condition and Temporal'!$B$6:$L$103,7,FALSE),IF(F47=\"Poor\",VLOOKUP(D47,'10. Condition and Temporal'!$B$6:$L$103,8,FALSE),IF(F47=\"Condition Assessment N/A\",VLOOKUP(D47,'10. Condition and Temporal'!$B$6:$L$103,9,FALSE),IF(F47=\"N/A - Other\",VLOOKUP(D47,'10. Condition and Temporal'!$B$6:$L$103,10,FALSE)))))))","v":""},{"$f":"IF(AE47=\"\",\"\",VLOOKUP(AE47,'11. Lists'!$I$47:$K$80,3,FALSE))","v":""},{"$f":"IF(D47=\"\",\"\",VLOOKUP(D47,'9. All Habitats + Multipliers'!$C$4:$K$102,7,FALSE))","v":""},{"$f":"IF(AG47=\"\",\"\",VLOOKUP(AG47,'11. Lists'!$J$35:$K$38,2,FALSE))","v":""}]
[null,10,"Hedgerows and Lines of trees",null,{"$f":"IF(D48=\"\",\"\",VLOOKUP(D48,'10. Condition and Temporal'!$B$6:$D$103,3,FALSE))","v":""},{"$nulls":6},"",{"$nulls":7},{"$f":"IF(D48=\"\",\"\",VLOOKUP(D48,'9. All Habitats + Multipliers'!$C$4:$K$102,5,FALSE))","v":""},null,{"$f":"IF(T48=\"\",\"\",VLOOKUP(T48,'11. Lists'!$S$47:$U$50,2,FALSE))","v":""},"",{"$f":"IF(W48=\"\",\"\",VLOOKUP(W48,'11. Lists'!$F$47:$G$51,2,FALSE))","v":""},{"$nulls":3},"",{"$f":"IF(AB48=\"\",\"\",VLOOKUP(AB48,'11. Lists'!$F$36:$H$38,2,FALSE))","v":""},{"$f":"IF(AB48=\"\",\"\",VLOOKUP(AB48,'11. Lists'!$F$36:$H$38,3,FALSE))","v":""},{"$f":"IF(F48=\"\",\"\",IF(F48=\"Moderate\",VLOOKUP(D48,'10. Condition and Temporal'!$B$6:$L$103,6,FALSE),IF(F48=\"Good\",VLOOKUP(D48,'10. Condition and Temporal'!$B$6:$L$103,7,FALSE),IF(F48=\"Poor\",VLOOKUP(D48,'10. Condition and Temporal'!$B$6:$L$103,8,FALSE),IF(F48=\"Condition Assessment N/A\",VLOOKUP(D48,'10. Condition and Temporal'!$B$6:$L$103,9,FALSE),IF(F48=\"N/A - Other\",VLOOKUP(D48,'10. Condition and Temporal'!$B$6:$L$103,10,FALSE)))))))","v":""},{"$f":"IF(AE48=\"\",\"\",VLOOKUP(AE48,'11. Lists'!$I$47:$K$80,3,FALSE))","v":""},{"$f":"IF(D48=\"\",\"\",VLOOKUP(D48,'9. All Habitats + Multipliers'!$C$4:$K$102,7,FALSE))","v":""},{"$f":"IF(AG48=\"\",\"\",VLOOKUP(AG48,'11. Lists'!$J$35:$K$38,2,FALSE))","v":""}]
[null,11,"Hedgerows and Lines of trees",null,{"$f":"IF(D49=\"\",\"\",VLOOKUP(D49,'10. Condition and Temporal'!$B$6:$D$103,3,FALSE))","v":""},{"$nulls":6},"",{"$nulls":7},{"$f":"IF(D49=\"\",\"\",VLOOKUP(D49,'9. All Habitats + Multipliers'!$C$4:$K$102,5,FALSE))","v":""},null,{"$f":"IF(T49=\"\",\"\",VLOOKUP(T49,'11. Lists'!$S$47:$U$50,2,FALSE))","v":""},"",{"$f":"IF(W49=\"\",\"\",VLOOKUP(W49,'11. Lists'!$F$47:$G$51,2,FALSE))","v":""},{"$nulls":3},"",{"$f":"IF(AB49=\"\",\"\",VLOOKUP(AB49,'11. Lists'!$F$36:$H$38,2,FALSE))","v":""},{"$f":"IF(AB49=\"\",\"\",VLOOKUP(AB49,'11. Lists'!$F$36:$H$38,3,FALSE))","v":""},{"$f":"IF(F49=\"\",\"\",IF(F49=\"Moderate\",VLOOKUP(D49,'10. Condition and Temporal'!$B$6:$L$103,6,FALSE),IF(F49=\"Good\",VLOOKUP(D49,'10. Condition and Temporal'!$B$6:$L$103,7,FALSE),IF(F49=\"Poor\",VLOOKUP(D49,'10. Condition and Temporal'!$B$6:$L$103,8,FALSE),IF(F49=\"Condition Assessment N/A\",VLOOKUP(D49,'10. Condition and Temporal'!$B$6:$L$103,9,FALSE),IF(F49=\"N/A - Other\",VLOOKUP(D49,'10. Condition and Temporal'!$B$6:$L$103,10,FALSE)))))))","v":""},{"$f":"IF(AE49=\"\",\"\",VLOOKUP(AE49,'11. Lists'!$I$47:$K$80,3,FALSE))","v":""},{"$f":"IF(D49=\"\",\"\",VLOOKUP(D49,'9. All Habitats + Multipliers'!$C$4:$K$102,7,FALSE))","v":""},{"$f":"IF(AG49=\"\",\"\",VLOOKUP(AG49,'11. Lists'!$J$35:$K$38,2,FALSE))","v":""}]
[null,12,"Hedgerows and Lines of trees",null,{"$f":"IF(D50=\"\",\"\",VLOOKUP(D50,'10. Condition and Temporal'!$B$6:$D$103,3,FALSE))","v":""},{"$nulls":6},"",{"$nulls":7},{"$f":"IF(D50=\"\",\"\",VLOOKUP(D50,'9. All Habitats + Multipliers'!$C$4:$K$102,5,FALSE))","v":""},null,{"$f":"IF(T50=\"\",\"\",VLOOKUP(T50,'11. Lists'!$S$47:$U$50,2,FALSE))","v":""},"",{"$f":"IF(W50=\"\",\"\",VLOOKUP(W50,'11. Lists'!$F$47:$G$51,2,FALSE))","v":""},{"$nulls":3},"",{"$f":"IF(AB50=\"\",\"\",VLOOKUP(AB50,'11. Lists'!$F$36:$H$38,2,FALSE))","v":""},{"$f":"IF(AB50=\"\",\"\",VLOOKUP(AB50,'11. Lists'!$F$36:$H$38,3,FALSE))","v":""},{"$f":"IF(F50=\"\",\"\",IF(F50=\"Moderate\",VLOOKUP(D50,'10. Condition and Temporal'!$B$6:$L$103,6,FALSE),IF(F50=\"Good\",VLOOKUP(D50,'10. Condition and Temporal'!$B$6:$L$103,7,FALSE),IF(F50=\"Poor\",VLOOKUP(D50,'10. Condition and Temporal'!$B$6:$L$103,8,FALSE),IF(F50=\"Condition Assessment N/A\",VLOOKUP(D50,'10. Condition and Temporal'!$B$6:$L$103,9,FALSE),IF(F50=\"N/A - Other\",VLOOKUP(D50,'10. Condition and Temporal'!$B$6:$L$103,10,FALSE)))))))","v":""},{"$f":"IF(AE50=\"\",\"\",VLOOKUP(AE50,'11. Lists'!$I$47:$K$80,3,FALSE))","v":""},{"$f":"IF(D50=\"\",\"\",VLOOKUP(D50,'9. All Habitats + Multipliers'!$C$4:$K$102,7,FALSE))","v":""},{"$f":"IF(AG50=\"\",\"\",VLOOKUP(AG50,'11. Lists'!$J$35:$K$38,2,FALSE))","v":""}]
[null,13,"Hedgerows and Lines of trees",null,{"$f":"IF(D51=\"\",\"\",VLOOKUP(D51,'10. Condition and Temporal'!$B$6:$D$103,3,FALSE))","v":""},{"$nulls":6},"",{"$nulls":7},{"$f":"IF(D51=\"\",\"\",VLOOKUP(D51,'9. All Habitats + Multipliers'!$C$4:$K$102,5,FALSE))","v":""},null,{"$f":"IF(T51=\"\",\"\",VLOOKUP(T51,'11. Lists'!$S$47:$U$50,2,FALSE))","v":""},"",{"$f":"IF(W51=\"\",\"\",VLOOKUP(W51,'11. Lists'!$F$47:$G$51,2,FALSE))","v":""},{"$nulls":3},"",{"$f":"IF(AB51=\"\",\"\",VLOOKUP(AB51,'11. Lists'!$F$36:$H$38,2,FALSE))","v":""},{"$f":"IF(AB51=\"\",\"\",VLOOKUP(AB51,'11. Lists'!$F$36:$H$38,3,FALSE))","v":""},{"$f":"IF(F51=\"\",\"\",IF(F51=\"Moderate\",VLOOKUP(D51,'10. Condition and Temporal'!$B$6:$L$103,6,FALSE),IF(F51=\"Good\",VLOOKUP(D51,'10. Condition and Temporal'!$B$6:$L$103,7,FALSE),IF(F51=\"Poor\",VLOOKUP(D51,'10. Condition and Temporal'!$B$6:$L$103,8,FALSE),IF(F51=\"Condition Assessment N/A\",VLOOKUP(D51,'10. Condition and Temporal'!$B$6:$L$103,9,FALSE),IF(F51=\"N/A - Other\",VLOOKUP(D51,'10. Condition and Temporal'!$B$6:$L$103,10,FALSE)))))))","v":""},{"$f":"IF(AE51=\"\",\"\",VLOOKUP(AE51,'11. Lists'!$I$47:$K$80,3,FALSE))","v":""},{"$f":"IF(D51=\"\",\"\",VLOOKUP(D51,'9. All Habitats + Multipliers'!$C$4:$K$102,7,FALSE))","v":""},{"$f":"IF(AG51=\"\",\"\",VLOOKUP(AG51,'11. Lists'!$J$35:$K$38,2,FALSE))","v":""}]
[null,14,"Hedgerows and Lines of trees",null,{"$f":"IF(D52=\"\",\"\",VLOOKUP(D52,'10. Condition and Temporal'!$B$6:$D$103,3,FALSE))","v":""},{"$nulls":6},"",{"$nulls":7},{"$f":"IF(D52=\"\",\"\",VLOOKUP(D52,'9. All Habitats + Multipliers'!$C$4:$K$102,5,FALSE))","v":""},null,{"$f":"IF(T52=\"\",\"\",VLOOKUP(T52,'11. Lists'!$S$47:$U$50,2,FALSE))","v":""},"",{"$f":"IF(W52=\"\",\"\",VLOOKUP(W52,'11. Lists'!$F$47:$G$51,2,FALSE))","v":""},{"$nulls":3},"",{"$f":"IF(AB52=\"\",\"\",VLOOKUP(AB52,'11. Lists'!$F$36:$H$38,2,FALSE))","v":""},{"$f":"IF(AB52=\"\",\"\",VLOOKUP(AB52,'11. Lists'!$F$36:$H$38,3,FALSE))","v":""},{"$f":"IF(F52=\"\",\"\",IF(F52=\"Moderate\",VLOOKUP(D52,'10. Condition and Temporal'!$B$6:$L$103,6,FALSE),IF(F52=\"Good\",VLOOKUP(D52,'10. Condition and Temporal'!$B$6:$L$103,7,FALSE),IF(F52=\"Poor\",VLOOKUP(D52,'10. Condition and Temporal'!$B$6:$L$103,8,FALSE),IF(F52=\"Condition Assessment N/A\",VLOOKUP(D52,'10. Condition and Temporal'!$B$6:$L$103,9,FALSE),IF(F52=\"N/A - Other\",VLOOKUP(D52,'10. Condition and Temporal'!$B$6:$L$103,10,FALSE)))))))","v":""},{"$f":"IF(AE52=\"\",\"\",VLOOKUP(AE52,'11. Lists'!$I$47:$K$80,3,FALSE))","v":""},{"$f":"IF(D52=\"\",\"\",VLOOKUP(D52,'9. All Habitats + Multipliers'!$C$4:$K$102,7,FALSE))","v":""},{"$f":"IF(AG52=\"\",\"\",VLOOKUP(AG52,'11. Lists'!$J$35:$K$38,2,FALSE))","v":""}]
[null,15,"Hedgerows and Lines of trees",null,{"$f":"IF(D53=\"\",\"\",VLOOKUP(D53,'10. Condition and Temporal'!$B$6:$D$103,3,FALSE))","v":""},{"$nulls":6},"",{"$nulls":7},{"$f":"IF(D53=\"\",\"\",VLOOKUP(D53,'9. All Habitats + Multipliers'!$C$4:$K$102,5,FALSE))","v":""},null,{"$f":"IF(T53=\"\",\"\",VLOOKUP(T53,'11. Lists'!$S$47:$U$50,2,FALSE))","v":""},"",{"$f":"IF(W53=\"\",\"\",VLOOKUP(W53,'11. Lists'!$F$47:$G$51,2,FALSE))","v":""},{"$nulls":3},"",{"$f":"IF(AB53=\"\",\"\",VLOOKUP(AB53,'11. Lists'!$F$36:$H$38,2,FALSE))","v":""},{"$f":"IF(AB53=\"\",\"\",VLOOKUP(AB53,'11. Lists'!$F$36:$H$38,3,FALSE))","v":""},{"$f":"IF(F53=\"\",\"\",IF(F53=\"Moderate\",VLOOKUP(D53,'10. Condition and Temporal'!$B$6:$L$103,6,FALSE),IF(F53=\"Good\",VLOOKUP(D53,'10. Condition and Temporal'!$B$6:$L$103,7,FALSE),IF(F53=\"Poor\",VLOOKUP(D53,'10. Condition and Temporal'!$B$6:$L$103,8,FALSE),IF(F53=\"Condition Assessment N/A\",VLOOKUP(D53,'10. Condition and Temporal'!$B$6:$L$103,9,FALSE),IF(F53=\"N/A - Other\",VLOOKUP(D53,'10. Condition and Temporal'!$B$6:$L$103,10,FALSE)))))))","v":""},{"$f":"IF(AE53=\"\",\"\",VLOOKUP(AE53,'11. Lists'!$I$47:$K$80,3,FALSE))","v":""},{"$f":"IF(D53=\"\",\"\",VLOOKUP(D53,'9. All Habitats + Multipliers'!$C$4:$K$102,7,FALSE))","v":""},{"$f":"IF(AG53=\"\",\"\",VLOOKUP(AG53,'11. Lists'!$J$35:$K$38,2,FALSE))","v":""}]
[null,16,"Hedgerows and Lines of trees",null,{"$f":"IF(D54=\"\",\"\",VLOOKUP(D54,'10. Condition and Temporal'!$B$6:$D$103,3,FALSE))","v":""},{"$nulls":6},"",{"$nulls":7},{"$f":"IF(D54=\"\",\"\",VLOOKUP(D54,'9. All Habitats + Multipliers'!$C$4:$K$102,5,FALSE))","v":""},null,{"$f":"IF(T54=\"\",\"\",VLOOKUP(T54,'11. Lists'!$S$47:$U$50,2,FALSE))","v":""},"",{"$f":"IF(W54=\"\",\"\",VLOOKUP(W54,'11. Lists'!$F$47:$G$51,2,FALSE))","v":""},{"$nulls":3},"",{"$f":"IF(AB54=\"\",\"\",VLOOKUP(AB54,'11. Lists'!$F$36:$H$38,2,FALSE))","v":""},{"$f":"IF(AB54=\"\",\"\",VLOOKUP(AB54,'11. Lists'!$F$36:$H$38,3,FALSE))","v":""},{"$f":"IF(F54=\"\",\"\",IF(F54=\"Moderate\",VLOOKUP(D54,'10. Condition and Temporal'!$B$6:$L$103,6,FALSE),IF(F54=\"Good\",VLOOKUP(D54,'10. Condition and Temporal'!$B$6:$L$103,7,FALSE),IF(F54=\"Poor\",VLOOKUP(D54,'10. Condition and Temporal'!$B$6:$L$103,8,FALSE),IF(F54=\"Condition Assessment N/A\",VLOOKUP(D54,'10. Condition and Temporal'!$B$6:$L$103,9,FALSE),IF(F54=\"N/A - Other\",VLOOKUP(D54,'10. Condition and Temporal'!$B$6:$L$103,10,FALSE)))))))","v":""},{"$f":"IF(AE54=\"\",\"\",VLOOKUP(AE54,'11. Lists'!$I$47:$K$80,3,FALSE))","v":""},{"$f":"IF(D54=\"\",\"\",VLOOKUP(D54,'9. All Habitats + Multipliers'!$C$4:$K$102,7,FALSE))","v":""},{"$f":"IF(AG54=\"\",\"\",VLOOKUP(AG54,'11. Lists'!$J$35:$K$38,2,FALSE))","v":""}]
[null,17,"Hedgerows and Lines of trees",null,{"$f":"IF(D55=\"\",\"\",VLOOKUP(D55,'10. Condition and Temporal'!$B$6:$D$103,3,FALSE))","v":""},{"$nulls":6},"",{"$nulls":7},{"$f":"IF(D55=\"\",\"\",VLOOKUP(D55,'9. All Habitats + Multipliers'!$C$4:$K$102,5,FALSE))","v":""},null,{"$f":"IF(T55=\"\",\"\",VLOOKUP(T55,'11. Lists'!$S$47:$U$50,2,FALSE))","v":""},"",{"$f":"IF(W55=\"\",\"\",VLOOKUP(W55,'11. Lists'!$F$47:$G$51,2,FALSE))","v":""},{"$nulls":3},"",{"$f":"IF(AB55=\"\",\"\",VLOOKUP(AB55,'11. Lists'!$F$36:$H$38,2,FALSE))","v":""},{"$f":"IF(AB55=\"\",\"\",VLOOKUP(AB55,'11. Lists'!$F$36:$H$38,3,FALSE))","v":""},{"$f":"IF(F55=\"\",\"\",IF(F55=\"Moderate\",VLOOKUP(D55,'10. Condition and Temporal'!$B$6:$L$103,6,FALSE),IF(F55=\"Good\",VLOOKUP(D55,'10. Condition and Temporal'!$B$6:$L$103,7,FALSE),IF(F55=\"Poor\",VLOOKUP(D55,'10. Condition and Temporal'!$B$6:$L$103,8,FALSE),IF(F55=\"Condition Assessment N/A\",VLOOKUP(D55,'10. Condition and Temporal'!$B$6:$L$103,9,FALSE),IF(F55=\"N/A - Other\",VLOOKUP(D55,'10. Condition and Temporal'!$B$6:$L$103,10,FALSE)))))))","v":""},{"$f":"IF(AE55=\"\",\"\",VLOOKUP(AE55,'11. Lists'!$I$47:$K$80,3,FALSE))","v":""},{"$f":"IF(D55=\"\",\"\",VLOOKUP(D55,'9. All Habitats + Multipliers'!$C$4:$K$102,7,FALSE))","v":""},{"$f":"IF(AG55=\"\",\"\",VLOOKUP(AG55,'11. Lists'!$J$35:$K$38,2,FALSE))","v":""}]
[null,18,"Hedgerows and Lines of trees",null,{"$f":"IF(D56=\"\",\"\",VLOOKUP(D56,'10. Condition and Temporal'!$B$6:$D$103,3,FALSE))","v":""},{"$nulls":6},"",{"$nulls":7},{"$f":"IF(D56=\"\",\"\",VLOOKUP(D56,'9. All Habitats + Multipliers'!$C$4:$K$102,5,FALSE))","v":""},null,{"$f":"IF(T56=\"\",\"\",VLOOKUP(T56,'11. Lists'!$S$47:$U$50,2,FALSE))","v":""},"",{"$f":"IF(W56=\"\",\"\",VLOOKUP(W56,'11. Lists'!$F$47:$G$51,2,FALSE))","v":""},{"$nulls":3},"",{"$f":"IF(AB56=\"\",\"\",VLOOKUP(AB56,'11. Lists'!$F$36:$H$38,2,FALSE))","v":""},{"$f":"IF(AB56=\"\",\"\",VLOOKUP(AB56,'11. Lists'!$F$36:$H$38,3,FALSE))","v":""},{"$f":"IF(F56=\"\",\"\",IF(F56=\"Moderate\",VLOOKUP(D56,'10. Condition and Temporal'!$B$6:$L$103,6,FALSE),IF(F56=\"Good\",VLOOKUP(D56,'10. Condition and Temporal'!$B$6:$L$103,7,FALSE),IF(F56=\"Poor\",VLOOKUP(D56,'10. Condition and Temporal'!$B$6:$L$103,8,FALSE),IF(F56=\"Condition Assessment N/A\",VLOOKUP(D56,'10. Condition and Temporal'!$B$6:$L$103,9,FALSE),IF(F56=\"N/A - Other\",VLOOKUP(D56,'10. Condition and Temporal'!$B$6:$L$103,10,FALSE)))))))","v":""},{"$f":"IF(AE56=\"\",\"\",VLOOKUP(AE56,'11. Lists'!$I$47:$K$80,3,FALSE))","v":""},{"$f":"IF(D56=\"\",\"\",VLOOKUP(D56,'9. All Habitats + Multipliers'!$C$4:$K$102,7,FALSE))","v":""},{"$f":"IF(AG56=\"\",\"\",VLOOKUP(AG56,'11. Lists'!$J$35:$K$38,2,FALSE))","v":""}]
[null,19,"Hedgerows and Lines of trees",null,{"$f":"IF(D57=\"\",\"\",VLOOKUP(D57,'10. Condition and Temporal'!$B$6:$D$103,3,FALSE))","v":""},{"$nulls":6},"",{"$nulls":7},{"$f":"IF(D57=\"\",\"\",VLOOKUP(D57,'9. All Habitats + Multipliers'!$C$4:$K$102,5,FALSE))","v":""},null,{"$f":"IF(T57=\"\",\"\",VLOOKUP(T57,'11. Lists'!$S$47:$U$50,2,FALSE))","v":""},"",{"$f":"IF(W57=\"\",\"\",VLOOKUP(W57,'11. Lists'!$F$47:$G$51,2,FALSE))","v":""},{"$nulls":3},"",{"$f":"IF(AB57=\"\",\"\",VLOOKUP(AB57,'11. Lists'!$F$36:$H$38,2,FALSE))","v":""},{"$f":"IF(AB57=\"\",\"\",VLOOKUP(AB57,'11. Lists'!$F$36:$H$38,3,FALSE))","v":""},{"$f":"IF(F57=\"\",\"\",IF(F57=\"Moderate\",VLOOKUP(D57,'10. Condition and Temporal'!$B$6:$L$103,6,FALSE),IF(F57=\"Good\",VLOOKUP(D57,'10. Condition and Temporal'!$B$6:$L$103,7,FALSE),IF(F57=\"Poor\",VLOOKUP(D57,'10. Condition and Temporal'!$B$6:$L$103,8,FALSE),IF(F57=\"Condition Assessment N/A\",VLOOKUP(D57,'10. Condition and Temporal'!$B$6:$L$103,9,FALSE),IF(F57=\"N/A - Other\",VLOOKUP(D57,'10. Condition and Temporal'!$B$6:$L$103,10,FALSE)))))))","v":""},{"$f":"IF(AE57=\"\",\"\",VLOOKUP(AE57,'11. Lists'!$I$47:$K$80,3,FALSE))","v":""},{"$f":"IF(D57=\"\",\"\",VLOOKUP(D57,'9. All Habitats + Multipliers'!$C$4:$K$102,7,FALSE))","v":""},{"$f":"IF(AG57=\"\",\"\",VLOOKUP(AG57,'11. Lists'!$J$35:$K$38,2,FALSE))","v":""}]
[null,20,"Hedgerows and Lines of trees",null,{"$f":"IF(D58=\"\",\"\",VLOOKUP(D58,'10. Condition and Temporal'!$B$6:$D$103,3,FALSE))","v":""},{"$nulls":6},"",{"$nulls":7},{"$f":"IF(D58=\"\",\"\",VLOOKUP(D58,'9. All Habitats + Multipliers'!$C$4:$K$102,5,FALSE))","v":""},null,{"$f":"IF(T58=\"\",\"\",VLOOKUP(T58,'11. Lists'!$S$47:$U$50,2,FALSE))","v":""},"",{"$f":"IF(W58=\"\",\"\",VLOOKUP(W58,'11. Lists'!$F$47:$G$51,2,FALSE))","v":""},{"$nulls":3},"",{"$f":"IF(AB58=\"\",\"\",VLOOKUP(AB58,'11. Lists'!$F$36:$H$38,2,FALSE))","v":""},{"$f":"IF(AB58=\"\",\"\",VLOOKUP(AB58,'11. Lists'!$F$36:$H$38,3,FALSE))","v":""},{"$f":"IF(F58=\"\",\"\",IF(F58=\"Moderate\",VLOOKUP(D58,'10. Condition and Temporal'!$B$6:$L$103,6,FALSE),IF(F58=\"Good\",VLOOKUP(D58,'10. Condition and Temporal'!$B$6:$L$103,7,FALSE),IF(F58=\"Poor\",VLOOKUP(D58,'10. Condition and Temporal'!$B$6:$L$103,8,FALSE),IF(F58=\"Condition Assessment N/A\",VLOOKUP(D58,'10. Condition and Temporal'!$B$6:$L$103,9,FALSE),IF(F58=\"N/A - Other\",VLOOKUP(D58,'10. Condition and Temporal'!$B$6:$L$103,10,FALSE)))))))","v":""},{"$f":"IF(AE58=\"\",\"\",VLOOKUP(AE58,'11. Lists'!$I$47:$K$80,3,FALSE))","v":""},{"$f":"IF(D58=\"\",\"\",VLOOKUP(D58,'9. All Habitats + Multipliers'!$C$4:$K$102,7,FALSE))","v":""},{"$f":"IF(AG58=\"\",\"\",VLOOKUP(AG58,'11. Lists'!$J$35:$K$38,2,FALSE))","v":""}]
[{"$nulls":7},"Totals",{"$f":"SUM(I39:K58)","v":{"v":13,"d":"13.00"}},null,null,{"$f":"SUM(L39:N58)","v":{"v":0.05086538813460001,"d":"0.0509"}}]
[{"$nulls":7},"Error Check 1",{"$f":"IF(I59<5000,\"Lengths Acceptable ✓\",IF(I59>=5000,\"Length Exceeds Length Appropriate for Small Sites Metric ▲\"))","v":"Lengths Acceptable ✓"}]
[{"$nulls":52},"Divider"]
[null,"1c. Habitats to be enhanced",{"$nulls":50},","]
[]
[null,"Baseline ref","Existing Habitat Type",null,"Enhanced Habitat type",null,null,"B. Strategic significance","Length Enhanced (m)","Enhanced Condition",null,"Total Units","Net Improvement",null,"Comments",{"$nulls":4},"Baseline Values",{"$nulls":10}," Distinctiveness change acceptable?","Enhanced multipliers",{"$nulls":10},"Condition enhancement - Time to target condition/years","Enhanced multipliers",{"$nulls":8},"Number of options",{"$f":"COUNTIF(BB66:BB85,\"?*\")","v":0},{"$f":"COUNTIF(BC66:BC85,\"?*\")","v":0},0,0,0,0,0,0,0,0,0,0,0,0,0,0,0,0,0,0]
[null,null,"Broad habitat type","Existing habitat type","Enhancement Type","A. Enhanced habitat type",{"$nulls":8},"User comments","LPA comments",{"$nulls":3},"Area enhanced","Baseline distinctiveness band","Baseline distinctiveness score","Baseline condition category","Baseline condition score",{"$nulls":3},"Baseline strategic significance category","Baseline strategic significance score","Baseline value of area enhanced",null,"Area enhanced","Distinctiveness","Score","Condition ","Score",{"$nulls":3},"Strategic significance","Strategic significance","Strategic significance multiplier",null,"Condition enhancement - Time to target multiplier","Distinctiveness enhancement - Time to target condition/years","Distinctiveness enhancement - Time to target multiplier","Difficulty of enhancement category","Difficulty of enhancement multiplier","Acceptable habitat types","Enhancement type",null,null,"option number",1,2,3,4,5,6,7,8,9,10,11,12,13,14,15,16,17,18,19,20,"List range","Column ref","list  length"]
[null,1,{"$f":"IF(D66=\"\",\"\",C11)","v":""},{"$f":"IF(OR(K11=\"\", K11=0),\"\",D11)","v":""},{"$f":"IF(AX66=\"\",\"\",AX66)","v":""},null,null,{"$f":"IF(D66=\"\",\"\",AB66)","v":""},{"$f":"IF(OR(K11=\"\", K11=0),\"\",K11)","v":""},{"$f":"IFERROR(IF(F66=\"\",\"\",VLOOKUP(F66,'10. Condition and Temporal'!$B$6:$F$103,5,FALSE)), \"Error ▲\")","v":""},null,{"$f":"IFERROR(IF(D66=\"\",\"\",IF(AX66=\"Distinctiveness\",(((((I66*AH66*AJ66)-(I66*V66*X66))*(AV66*AT66))+(I66*V66*X66))*AP66/1000),((((I66*AH66*AJ66)-(I66*V66*X66))*(AV66*AR66))+(I66*V66*X66))*AP66/1000)),\"This intervention is not permitted within the SSM ▲\")","v":""},{"$f":"IFERROR(IF(F66=\"\",\"\",L66-AD66), \"Error ▲\")","v":""},{"$nulls":6},{"$f":"IF(D66=\"\",\"\",K11)","v":""},{"$f":"IF($D66=\"\",\"\",T11)","v":""},{"$f":"IF($D66=\"\",\"\",V11)","v":""},"","",{"$nulls":3},{"$f":"IF($D66=\"\",\"\",AB11)","v":""},{"$f":"IF($D66=\"\",\"\",AD11)","v":""},{"$f":"IF(AC66=\"\",\"\",(T66*V66*X66)*AC66/1000)","v":""},{"$f":"IF(AD66=\"\",\"\",IF(AH66<V66,\"Not Acceptable\",\"Acceptable\"))","v":""},{"$f":"IF(D66=\"\",\"\",I66)","v":""},{"$f":"IF(D66=\"\",\"\",VLOOKUP(F66,'9. All Habitats + Multipliers'!$C$4:$K$102,5,FALSE))","v":""},{"$f":"IF(AG66=\"\",\"\",VLOOKUP(AG66,'11. Lists'!$S$47:$U$50,2,FALSE))","v":""},{"$f":"IF(D66=\"\",\"\",J66)","v":""},{"$f":"IF(AI66=\"\",\"\",VLOOKUP(AI66,'11. Lists'!$F$47:$G$51,2,FALSE))","v":""},{"$nulls":3},{"$f":"IF(H66=\"\",\"\",H66)","v":""},{"$f":"IF(AN66=\"\",\"\",VLOOKUP(AN66,'11. Lists'!$F$36:$H$38,2,FALSE))","v":""},{"$f":"IF(AN66=\"\",\"\",VLOOKUP(AN66,'11. Lists'!$F$36:$H$38,3,FALSE))","v":""},{"$f":"IF(D66=\"\",\"\",IF(AX66=\"Distinctiveness\",\"N/A\",VLOOKUP(F66,'10. Condition and Temporal'!$B$6:$L$103,11,FALSE)))","v":""},{"$f":"IF(AQ66=\"\",\"\",IF(AQ66=\"N/A\",\"1\",VLOOKUP(AQ66,'11. Lists'!$I$47:$K$80,3,FALSE)))","v":""},{"$f":"IF(D66=\"\",\"\",IF(AX66=\"Condition\",\"N/A\",VLOOKUP(F66,'10. Condition and Temporal'!$B$6:$M$106,12,FALSE)))","v":""},{"$f":"IF(AS66=\"\",\"\",IF(AS66=\"N/A\",\"1\",VLOOKUP(AS66,'11. Lists'!$I$47:$K$80,3,FALSE)))","v":""},{"$f":"IF(D66=\"\",\"\",VLOOKUP(F66,'9. All Habitats + Multipliers'!$C$4:$K$102,8,FALSE))","v":""},{"$f":"IF(AU66=\"\",\"\",VLOOKUP(AU66,'11. Lists'!$J$35:$K$38,2,FALSE))","v":""},{"$f":"IF(D66=\"\",\"\",VLOOKUP(D66,'10. Condition and Temporal'!$B$6:$M$103,4,FALSE))","v":""},{"$f":"IF(F66=\"\",\"\",IF(D66=F66,\"Condition\",\"Distinctiveness\"))","v":""},null,null,1,{"$f":"TRIM(MID(SUBSTITUTE($AW$66,$BA$62,REPT(\" \",LEN($AW$66))),($BA66-1)*LEN($AW$66)+1,LEN($AW$66)))","v":""},{"$f":"TRIM(MID(SUBSTITUTE($AW$67,$BA$62,REPT(\" \",LEN($AW$67))),($BA66-1)*LEN($AW$67)+1,LEN($AW$67)))","v":""},{"$f":"TRIM(MID(SUBSTITUTE($AW$68,$BA$62,REPT(\" \",LEN($AW$68))),($BA66-1)*LEN($AW$68)+1,LEN($AW$68)))","v":""},{"$f":"TRIM(MID(SUBSTITUTE($AW$69,$BA$62,REPT(\" \",LEN($AW$69))),($BA66-1)*LEN($AW$69)+1,LEN($AW$69)))","v":""},{"$f":"TRIM(MID(SUBSTITUTE($AW$70,$BA$62,REPT(\" \",LEN($AW$70))),($BA66-1)*LEN($AW$70)+1,LEN($AW$70)))","v":""},{"$f":"TRIM(MID(SUBSTITUTE($AW$71,$BA$62,REPT(\" \",LEN($AW$71))),($BA66-1)*LEN($AW$71)+1,LEN($AW$71)))","v":""},{"$f":"TRIM(MID(SUBSTITUTE($AW$72,$BA$62,REPT(\" \",LEN($AW$72))),($BA66-1)*LEN($AW$72)+1,LEN($AW$72)))","v":""},{"$f":"TRIM(MID(SUBSTITUTE($AW$73,$BA$62,REPT(\" \",LEN($AW$73))),($BA66-1)*LEN($AW$73)+1,LEN($AW$73)))","v":""},{"$f":"TRIM(MID(SUBSTITUTE($AW$74,$BA$62,REPT(\" \",LEN($AW$74))),($BA66-1)*LEN($AW$74)+1,LEN($AW$74)))","v":""},{"$f":"TRIM(MID(SUBSTITUTE($AW$75,$BA$62,REPT(\" \",LEN($AW$75))),($BA66-1)*LEN($AW$75)+1,LEN($AW$75)))","v":""},{"$f":"TRIM(MID(SUBSTITUTE($AW$76,$BA$62,REPT(\" \",LEN($AW$76))),($BA66-1)*LEN($AW$76)+1,LEN($AW$76)))","v":""},{"$f":"TRIM(MID(SUBSTITUTE($AW$77,$BA$62,REPT(\" \",LEN($AW$77))),($BA66-1)*LEN($AW$77)+1,LEN($AW$77)))","v":""},{"$f":"TRIM(MID(SUBSTITUTE($AW$78,$BA$62,REPT(\" \",LEN($AW$78))),($BA66-1)*LEN($AW$78)+1,LEN($AW$78)))","v":""},{"$f":"TRIM(MID(SUBSTITUTE($AW$79,$BA$62,REPT(\" \",LEN($AW$79))),($BA66-1)*LEN($AW$79)+1,LEN($AW$79)))","v":""},{"$f":"TRIM(MID(SUBSTITUTE($AW$80,$BA$62,REPT(\" \",LEN($AW$80))),($BA66-1)*LEN($AW$80)+1,LEN($AW$80)))","v":""},{"$f":"TRIM(MID(SUBSTITUTE($AW$81,$BA$62,REPT(\" \",LEN($AW$81))),($BA66-1)*LEN($AW$81)+1,LEN($AW$81)))","v":""},{"$f":"TRIM(MID(SUBSTITUTE($AW$82,$BA$62,REPT(\" \",LEN($AW$82))),($BA66-1)*LEN($AW$82)+1,LEN($AW$82)))","v":""},{"$f":"TRIM(MID(SUBSTITUTE($AW$83,$BA$62,REPT(\" \",LEN($AW$83))),($BA66-1)*LEN($AW$83)+1,LEN($AW$83)))","v":""},{"$f":"TRIM(MID(SUBSTITUTE($AW$84,$BA$62,REPT(\" \",LEN($AW$84))),($BA66-1)*LEN($AW$84)+1,LEN($AW$84)))","v":""},{"$f":"TRIM(MID(SUBSTITUTE($AW$85,$BA$62,REPT(\" \",LEN($AW$85))),($BA66-1)*LEN($AW$85)+1,LEN($AW$85)))","v":""},{"$f":"IF(BX66=0,\"\",CONCATENATE(BW66,\"66:\",BW66,BX66+65))","v":""},"BB",{"$f":"BB64","v":0}]
[null,2,"",{"$f":"IF(OR(K12=\"\", K12=0),\"\",D12)","v":""},"",null,null,"",{"$f":"IF(OR(K12=\"\", K12=0),\"\",K12)","v":""},{"$f":"IFERROR(IF(F67=\"\",\"\",VLOOKUP(F67,'10. Condition and Temporal'!$B$6:$F$103,5,FALSE)), \"Error ▲\")","v":""},null,{"$f":"IFERROR(IF(D67=\"\",\"\",IF(AX67=\"Distinctiveness\",(((((I67*AH67*AJ67)-(I67*V67*X67))*(AV67*AT67))+(I67*V67*X67))*AP67/1000),((((I67*AH67*AJ67)-(I67*V67*X67))*(AV67*AR67))+(I67*V67*X67))*AP67/1000)),\"This intervention is not permitted within the SSM ▲\")","v":""},{"$f":"IFERROR(IF(F67=\"\",\"\",L67-AD67), \"Error ▲\")","v":""},{"$nulls":6},"",{"$f":"IF($D67=\"\",\"\",T12)","v":""},"","","",{"$nulls":3},"","",{"$f":"IF(AC67=\"\",\"\",(T67*V67*X67)*AC67/1000)","v":""},{"$f":"IF(AD67=\"\",\"\",IF(AH67<V67,\"Not Acceptable\",\"Acceptable\"))","v":""},"",{"$f":"IF(D67=\"\",\"\",VLOOKUP(F67,'9. All Habitats + Multipliers'!$C$4:$K$102,5,FALSE))","v":""},{"$f":"IF(AG67=\"\",\"\",VLOOKUP(AG67,'11. Lists'!$S$47:$U$50,2,FALSE))","v":""},"",{"$f":"IF(AI67=\"\",\"\",VLOOKUP(AI67,'11. Lists'!$F$47:$G$51,2,FALSE))","v":""},{"$nulls":3},"",{"$f":"IF(AN67=\"\",\"\",VLOOKUP(AN67,'11. Lists'!$F$36:$H$38,2,FALSE))","v":""},{"$f":"IF(AN67=\"\",\"\",VLOOKUP(AN67,'11. Lists'!$F$36:$H$38,3,FALSE))","v":""},{"$f":"IF(D67=\"\",\"\",IF(AX67=\"Distinctiveness\",\"N/A\",VLOOKUP(F67,'10. Condition and Temporal'!$B$6:$L$103,11,FALSE)))","v":""},{"$f":"IF(AQ67=\"\",\"\",IF(AQ67=\"N/A\",\"1\",VLOOKUP(AQ67,'11. Lists'!$I$47:$K$80,3,FALSE)))","v":""},{"$f":"IF(D67=\"\",\"\",IF(AX67=\"Condition\",\"N/A\",VLOOKUP(F67,'10. Condition and Temporal'!$B$6:$M$106,12,FALSE)))","v":""},{"$f":"IF(AS67=\"\",\"\",IF(AS67=\"N/A\",\"1\",VLOOKUP(AS67,'11. Lists'!$I$47:$K$80,3,FALSE)))","v":""},{"$f":"IF(D67=\"\",\"\",VLOOKUP(F67,'9. All Habitats + Multipliers'!$C$4:$K$102,8,FALSE))","v":""},{"$f":"IF(AU67=\"\",\"\",VLOOKUP(AU67,'11. Lists'!$J$35:$K$38,2,FALSE))","v":""},{"$f":"IF(D67=\"\",\"\",VLOOKUP(D67,'10. Condition and Temporal'!$B$6:$M$103,4,FALSE))","v":""},"",null,null,2,"","","","","","","","","","","","","","","","","","","","",{"$f":"IF(BX67=0,\"\",CONCATENATE(BW67,\"66:\",BW67,BX67+65))","v":""},"BC",{"$f":"BC64","v":0}]
[null,3,"","","",null,null,"","",{"$f":"IFERROR(IF(F68=\"\",\"\",VLOOKUP(F68,'10. Condition and Temporal'!$B$6:$F$103,5,FALSE)), \"Error ▲\")","v":""},null,"","",{"$nulls":6},"","","","","",{"$nulls":3},"","",{"$f":"IF(AC68=\"\",\"\",(T68*V68*X68)*AC68/1000)","v":""},"","",{"$f":"IF(D68=\"\",\"\",VLOOKUP(F68,'9. All Habitats + Multipliers'!$C$4:$K$102,5,FALSE))","v":""},{"$f":"IF(AG68=\"\",\"\",VLOOKUP(AG68,'11. Lists'!$S$47:$U$50,2,FALSE))","v":""},"",{"$f":"IF(AI68=\"\",\"\",VLOOKUP(AI68,'11. Lists'!$F$47:$G$51,2,FALSE))","v":""},{"$nulls":3},"",{"$f":"IF(AN68=\"\",\"\",VLOOKUP(AN68,'11. Lists'!$F$36:$H$38,2,FALSE))","v":""},{"$f":"IF(AN68=\"\",\"\",VLOOKUP(AN68,'11. Lists'!$F$36:$H$38,3,FALSE))","v":""},{"$f":"IF(D68=\"\",\"\",IF(AX68=\"Distinctiveness\",\"N/A\",VLOOKUP(F68,'10. Condition and Temporal'!$B$6:$L$103,11,FALSE)))","v":""},{"$f":"IF(AQ68=\"\",\"\",IF(AQ68=\"N/A\",\"1\",VLOOKUP(AQ68,'11. Lists'!$I$47:$K$80,3,FALSE)))","v":""},{"$f":"IF(D68=\"\",\"\",IF(AX68=\"Condition\",\"N/A\",VLOOKUP(F68,'10. Condition and Temporal'!$B$6:$M$106,12,FALSE)))","v":""},{"$f":"IF(AS68=\"\",\"\",IF(AS68=\"N/A\",\"1\",VLOOKUP(AS68,'11. Lists'!$I$47:$K$80,3,FALSE)))","v":""},{"$f":"IF(D68=\"\",\"\",VLOOKUP(F68,'9. All Habitats + Multipliers'!$C$4:$K$102,8,FALSE))","v":""},{"$f":"IF(AU68=\"\",\"\",VLOOKUP(AU68,'11. Lists'!$J$35:$K$38,2,FALSE))","v":""},{"$f":"IF(D68=\"\",\"\",VLOOKUP(D68,'10. Condition and Temporal'!$B$6:$M$103,4,FALSE))","v":""},"",null,null,3,"","","","","","","","","","","","","","","","","","","","","","BD",{"$f":"BD64","v":0}]
[null,4,"","","",null,null,"","",{"$f":"IFERROR(IF(F69=\"\",\"\",VLOOKUP(F69,'10. Condition and Temporal'!$B$6:$F$103,5,FALSE)), \"Error ▲\")","v":""},null,"","",{"$nulls":6},"","","","","",{"$nulls":3},"","","","","",{"$f":"IF(D69=\"\",\"\",VLOOKUP(F69,'9. All Habitats + Multipliers'!$C$4:$K$102,5,FALSE))","v":""},{"$f":"IF(AG69=\"\",\"\",VLOOKUP(AG69,'11. Lists'!$S$47:$U$50,2,FALSE))","v":""},"",{"$f":"IF(AI69=\"\",\"\",VLOOKUP(AI69,'11. Lists'!$F$47:$G$51,2,FALSE))","v":""},{"$nulls":3},"",{"$f":"IF(AN69=\"\",\"\",VLOOKUP(AN69,'11. Lists'!$F$36:$H$38,2,FALSE))","v":""},{"$f":"IF(AN69=\"\",\"\",VLOOKUP(AN69,'11. Lists'!$F$36:$H$38,3,FALSE))","v":""},{"$f":"IF(D69=\"\",\"\",IF(AX69=\"Distinctiveness\",\"N/A\",VLOOKUP(F69,'10. Condition and Temporal'!$B$6:$L$103,11,FALSE)))","v":""},{"$f":"IF(AQ69=\"\",\"\",IF(AQ69=\"N/A\",\"1\",VLOOKUP(AQ69,'11. Lists'!$I$47:$K$80,3,FALSE)))","v":""},{"$f":"IF(D69=\"\",\"\",IF(AX69=\"Condition\",\"N/A\",VLOOKUP(F69,'10. Condition and Temporal'!$B$6:$M$106,12,FALSE)))","v":""},{"$f":"IF(AS69=\"\",\"\",IF(AS69=\"N/A\",\"1\",VLOOKUP(AS69,'11. Lists'!$I$47:$K$80,3,FALSE)))","v":""},{"$f":"IF(D69=\"\",\"\",VLOOKUP(F69,'9. All Habitats + Multipliers'!$C$4:$K$102,8,FALSE))","v":""},{"$f":"IF(AU69=\"\",\"\",VLOOKUP(AU69,'11. Lists'!$J$35:$K$38,2,FALSE))","v":""},{"$f":"IF(D69=\"\",\"\",VLOOKUP(D69,'10. Condition and Temporal'!$B$6:$M$103,4,FALSE))","v":""},"",null,null,4,"","","","","","","","","","","","","","","","","","","","","","BE",{"$f":"BE64","v":0}]
[null,5,"","","",null,null,"","",{"$f":"IFERROR(IF(F70=\"\",\"\",VLOOKUP(F70,'10. Condition and Temporal'!$B$6:$F$103,5,FALSE)), \"Error ▲\")","v":""},null,"","",{"$nulls":6},"","","","","",{"$nulls":3},"","","","","",{"$f":"IF(D70=\"\",\"\",VLOOKUP(F70,'9. All Habitats + Multipliers'!$C$4:$K$102,5,FALSE))","v":""},{"$f":"IF(AG70=\"\",\"\",VLOOKUP(AG70,'11. Lists'!$S$47:$U$50,2,FALSE))","v":""},"",{"$f":"IF(AI70=\"\",\"\",VLOOKUP(AI70,'11. Lists'!$F$47:$G$51,2,FALSE))","v":""},{"$nulls":3},"",{"$f":"IF(AN70=\"\",\"\",VLOOKUP(AN70,'11. Lists'!$F$36:$H$38,2,FALSE))","v":""},{"$f":"IF(AN70=\"\",\"\",VLOOKUP(AN70,'11. Lists'!$F$36:$H$38,3,FALSE))","v":""},{"$f":"IF(D70=\"\",\"\",IF(AX70=\"Distinctiveness\",\"N/A\",VLOOKUP(F70,'10. Condition and Temporal'!$B$6:$L$103,11,FALSE)))","v":""},{"$f":"IF(AQ70=\"\",\"\",IF(AQ70=\"N/A\",\"1\",VLOOKUP(AQ70,'11. Lists'!$I$47:$K$80,3,FALSE)))","v":""},{"$f":"IF(D70=\"\",\"\",IF(AX70=\"Condition\",\"N/A\",VLOOKUP(F70,'10. Condition and Temporal'!$B$6:$M$106,12,FALSE)))","v":""},{"$f":"IF(AS70=\"\",\"\",IF(AS70=\"N/A\",\"1\",VLOOKUP(AS70,'11. Lists'!$I$47:$K$80,3,FALSE)))","v":""},{"$f":"IF(D70=\"\",\"\",VLOOKUP(F70,'9. All Habitats + Multipliers'!$C$4:$K$102,8,FALSE))","v":""},{"$f":"IF(AU70=\"\",\"\",VLOOKUP(AU70,'11. Lists'!$J$35:$K$38,2,FALSE))","v":""},{"$f":"IF(D70=\"\",\"\",VLOOKUP(D70,'10. Condition and Temporal'!$B$6:$M$103,4,FALSE))","v":""},"",null,null,5,"","","","","","","","","","","","","","","","","","","","","","BF",{"$f":"BF64","v":0}]
[null,6,"","","",null,null,"","",{"$f":"IFERROR(IF(F71=\"\",\"\",VLOOKUP(F71,'10. Condition and Temporal'!$B$6:$F$103,5,FALSE)), \"Error ▲\")","v":""},null,"","",{"$nulls":6},"","","","","",{"$nulls":3},"","","","","",{"$f":"IF(D71=\"\",\"\",VLOOKUP(F71,'9. All Habitats + Multipliers'!$C$4:$K$102,5,FALSE))","v":""},{"$f":"IF(AG71=\"\",\"\",VLOOKUP(AG71,'11. Lists'!$S$47:$U$50,2,FALSE))","v":""},"",{"$f":"IF(AI71=\"\",\"\",VLOOKUP(AI71,'11. Lists'!$F$47:$G$51,2,FALSE))","v":""},{"$nulls":3},"",{"$f":"IF(AN71=\"\",\"\",VLOOKUP(AN71,'11. Lists'!$F$36:$H$38,2,FALSE))","v":""},{"$f":"IF(AN71=\"\",\"\",VLOOKUP(AN71,'11. Lists'!$F$36:$H$38,3,FALSE))","v":""},{"$f":"IF(D71=\"\",\"\",IF(AX71=\"Distinctiveness\",\"N/A\",VLOOKUP(F71,'10. Condition and Temporal'!$B$6:$L$103,11,FALSE)))","v":""},{"$f":"IF(AQ71=\"\",\"\",IF(AQ71=\"N/A\",\"1\",VLOOKUP(AQ71,'11. Lists'!$I$47:$K$80,3,FALSE)))","v":""},{"$f":"IF(D71=\"\",\"\",IF(AX71=\"Condition\",\"N/A\",VLOOKUP(F71,'10. Condition and Temporal'!$B$6:$M$106,12,FALSE)))","v":""},{"$f":"IF(AS71=\"\",\"\",IF(AS71=\"N/A\",\"1\",VLOOKUP(AS71,'11. Lists'!$I$47:$K$80,3,FALSE)))","v":""},{"$f":"IF(D71=\"\",\"\",VLOOKUP(F71,'9. All Habitats + Multipliers'!$C$4:$K$102,8,FALSE))","v":""},{"$f":"IF(AU71=\"\",\"\",VLOOKUP(AU71,'11. Lists'!$J$35:$K$38,2,FALSE))","v":""},{"$f":"IF(D71=\"\",\"\",VLOOKUP(D71,'10. Condition and Temporal'!$B$6:$M$103,4,FALSE))","v":""},"",null,null,6,"","","","","","","","","","","","","","","","","","","","","","BG",{"$f":"BG64","v":0}]
[null,7,"","","",null,null,"","",{"$f":"IFERROR(IF(F72=\"\",\"\",VLOOKUP(F72,'10. Condition and Temporal'!$B$6:$F$103,5,FALSE)), \"Error ▲\")","v":""},null,"","",{"$nulls":6},"","","","","",{"$nulls":3},"","","","","",{"$f":"IF(D72=\"\",\"\",VLOOKUP(F72,'9. All Habitats + Multipliers'!$C$4:$K$102,5,FALSE))","v":""},{"$f":"IF(AG72=\"\",\"\",VLOOKUP(AG72,'11. Lists'!$S$47:$U$50,2,FALSE))","v":""},"",{"$f":"IF(AI72=\"\",\"\",VLOOKUP(AI72,'11. Lists'!$F$47:$G$51,2,FALSE))","v":""},{"$nulls":3},"",{"$f":"IF(AN72=\"\",\"\",VLOOKUP(AN72,'11. Lists'!$F$36:$H$38,2,FALSE))","v":""},{"$f":"IF(AN72=\"\",\"\",VLOOKUP(AN72,'11. Lists'!$F$36:$H$38,3,FALSE))","v":""},{"$f":"IF(D72=\"\",\"\",IF(AX72=\"Distinctiveness\",\"N/A\",VLOOKUP(F72,'10. Condition and Temporal'!$B$6:$L$103,11,FALSE)))","v":""},{"$f":"IF(AQ72=\"\",\"\",IF(AQ72=\"N/A\",\"1\",VLOOKUP(AQ72,'11. Lists'!$I$47:$K$80,3,FALSE)))","v":""},{"$f":"IF(D72=\"\",\"\",IF(AX72=\"Condition\",\"N/A\",VLOOKUP(F72,'10. Condition and Temporal'!$B$6:$M$106,12,FALSE)))","v":""},{"$f":"IF(AS72=\"\",\"\",IF(AS72=\"N/A\",\"1\",VLOOKUP(AS72,'11. Lists'!$I$47:$K$80,3,FALSE)))","v":""},{"$f":"IF(D72=\"\",\"\",VLOOKUP(F72,'9. All Habitats + Multipliers'!$C$4:$K$102,8,FALSE))","v":""},{"$f":"IF(AU72=\"\",\"\",VLOOKUP(AU72,'11. Lists'!$J$35:$K$38,2,FALSE))","v":""},{"$f":"IF(D72=\"\",\"\",VLOOKUP(D72,'10. Condition and Temporal'!$B$6:$M$103,4,FALSE))","v":""},"",null,null,7,"","","","","","","","","","","","","","","","","","","","","","BH",{"$f":"BH64","v":0}]
[null,8,"","","",null,null,"","",{"$f":"IFERROR(IF(F73=\"\",\"\",VLOOKUP(F73,'10. Condition and Temporal'!$B$6:$F$103,5,FALSE)), \"Error ▲\")","v":""},null,"","",{"$nulls":6},"","","","","",{"$nulls":3},"","","","","",{"$f":"IF(D73=\"\",\"\",VLOOKUP(F73,'9. All Habitats + Multipliers'!$C$4:$K$102,5,FALSE))","v":""},{"$f":"IF(AG73=\"\",\"\",VLOOKUP(AG73,'11. Lists'!$S$47:$U$50,2,FALSE))","v":""},"",{"$f":"IF(AI73=\"\",\"\",VLOOKUP(AI73,'11. Lists'!$F$47:$G$51,2,FALSE))","v":""},{"$nulls":3},"",{"$f":"IF(AN73=\"\",\"\",VLOOKUP(AN73,'11. Lists'!$F$36:$H$38,2,FALSE))","v":""},{"$f":"IF(AN73=\"\",\"\",VLOOKUP(AN73,'11. Lists'!$F$36:$H$38,3,FALSE))","v":""},{"$f":"IF(D73=\"\",\"\",IF(AX73=\"Distinctiveness\",\"N/A\",VLOOKUP(F73,'10. Condition and Temporal'!$B$6:$L$103,11,FALSE)))","v":""},{"$f":"IF(AQ73=\"\",\"\",IF(AQ73=\"N/A\",\"1\",VLOOKUP(AQ73,'11. Lists'!$I$47:$K$80,3,FALSE)))","v":""},{"$f":"IF(D73=\"\",\"\",IF(AX73=\"Condition\",\"N/A\",VLOOKUP(F73,'10. Condition and Temporal'!$B$6:$M$106,12,FALSE)))","v":""},{"$f":"IF(AS73=\"\",\"\",IF(AS73=\"N/A\",\"1\",VLOOKUP(AS73,'11. Lists'!$I$47:$K$80,3,FALSE)))","v":""},{"$f":"IF(D73=\"\",\"\",VLOOKUP(F73,'9. All Habitats + Multipliers'!$C$4:$K$102,8,FALSE))","v":""},{"$f":"IF(AU73=\"\",\"\",VLOOKUP(AU73,'11. Lists'!$J$35:$K$38,2,FALSE))","v":""},{"$f":"IF(D73=\"\",\"\",VLOOKUP(D73,'10. Condition and Temporal'!$B$6:$M$103,4,FALSE))","v":""},"",null,null,8,"","","","","","","","","","","","","","","","","","","","","","BI",{"$f":"BI64","v":0}]
[null,9,"","","",null,null,"","",{"$f":"IFERROR(IF(F74=\"\",\"\",VLOOKUP(F74,'10. Condition and Temporal'!$B$6:$F$103,5,FALSE)), \"Error ▲\")","v":""},null,"","",{"$nulls":6},"","","","","",{"$nulls":3},"","","","","",{"$f":"IF(D74=\"\",\"\",VLOOKUP(F74,'9. All Habitats + Multipliers'!$C$4:$K$102,5,FALSE))","v":""},{"$f":"IF(AG74=\"\",\"\",VLOOKUP(AG74,'11. Lists'!$S$47:$U$50,2,FALSE))","v":""},"",{"$f":"IF(AI74=\"\",\"\",VLOOKUP(AI74,'11. Lists'!$F$47:$G$51,2,FALSE))","v":""},{"$nulls":3},"",{"$f":"IF(AN74=\"\",\"\",VLOOKUP(AN74,'11. Lists'!$F$36:$H$38,2,FALSE))","v":""},{"$f":"IF(AN74=\"\",\"\",VLOOKUP(AN74,'11. Lists'!$F$36:$H$38,3,FALSE))","v":""},{"$f":"IF(D74=\"\",\"\",IF(AX74=\"Distinctiveness\",\"N/A\",VLOOKUP(F74,'10. Condition and Temporal'!$B$6:$L$103,11,FALSE)))","v":""},{"$f":"IF(AQ74=\"\",\"\",IF(AQ74=\"N/A\",\"1\",VLOOKUP(AQ74,'11. Lists'!$I$47:$K$80,3,FALSE)))","v":""},{"$f":"IF(D74=\"\",\"\",IF(AX74=\"Condition\",\"N/A\",VLOOKUP(F74,'10. Condition and Temporal'!$B$6:$M$106,12,FALSE)))","v":""},{"$f":"IF(AS74=\"\",\"\",IF(AS74=\"N/A\",\"1\",VLOOKUP(AS74,'11. Lists'!$I$47:$K$80,3,FALSE)))","v":""},{"$f":"IF(D74=\"\",\"\",VLOOKUP(F74,'9. All Habitats + Multipliers'!$C$4:$K$102,8,FALSE))","v":""},{"$f":"IF(AU74=\"\",\"\",VLOOKUP(AU74,'11. Lists'!$J$35:$K$38,2,FALSE))","v":""},{"$f":"IF(D74=\"\",\"\",VLOOKUP(D74,'10. Condition and Temporal'!$B$6:$M$103,4,FALSE))","v":""},"",null,null,9,"","","","","","","","","","","","","","","","","","","","","","BJ",{"$f":"BJ64","v":0}]
[null,10,"","","",null,null,"","",{"$f":"IFERROR(IF(F75=\"\",\"\",VLOOKUP(F75,'10. Condition and Temporal'!$B$6:$F$103,5,FALSE)), \"Error ▲\")","v":""},null,"","",{"$nulls":6},"","","","","",{"$nulls":3},"","","","","",{"$f":"IF(D75=\"\",\"\",VLOOKUP(F75,'9. All Habitats + Multipliers'!$C$4:$K$102,5,FALSE))","v":""},{"$f":"IF(AG75=\"\",\"\",VLOOKUP(AG75,'11. Lists'!$S$47:$U$50,2,FALSE))","v":""},"",{"$f":"IF(AI75=\"\",\"\",VLOOKUP(AI75,'11. Lists'!$F$47:$G$51,2,FALSE))","v":""},{"$nulls":3},"",{"$f":"IF(AN75=\"\",\"\",VLOOKUP(AN75,'11. Lists'!$F$36:$H$38,2,FALSE))","v":""},{"$f":"IF(AN75=\"\",\"\",VLOOKUP(AN75,'11. Lists'!$F$36:$H$38,3,FALSE))","v":""},{"$f":"IF(D75=\"\",\"\",IF(AX75=\"Distinctiveness\",\"N/A\",VLOOKUP(F75,'10. Condition and Temporal'!$B$6:$L$103,11,FALSE)))","v":""},{"$f":"IF(AQ75=\"\",\"\",IF(AQ75=\"N/A\",\"1\",VLOOKUP(AQ75,'11. Lists'!$I$47:$K$80,3,FALSE)))","v":""},{"$f":"IF(D75=\"\",\"\",IF(AX75=\"Condition\",\"N/A\",VLOOKUP(F75,'10. Condition and Temporal'!$B$6:$M$106,12,FALSE)))","v":""},{"$f":"IF(AS75=\"\",\"\",IF(AS75=\"N/A\",\"1\",VLOOKUP(AS75,'11. Lists'!$I$47:$K$80,3,FALSE)))","v":""},{"$f":"IF(D75=\"\",\"\",VLOOKUP(F75,'9. All Habitats + Multipliers'!$C$4:$K$102,8,FALSE))","v":""},{"$f":"IF(AU75=\"\",\"\",VLOOKUP(AU75,'11. Lists'!$J$35:$K$38,2,FALSE))","v":""},{"$f":"IF(D75=\"\",\"\",VLOOKUP(D75,'10. Condition and Temporal'!$B$6:$M$103,4,FALSE))","v":""},"",null,null,10,"","","","","","","","","","","","","","","","","","","","","","BK",{"$f":"BK64","v":0}]
[null,11,"","","",null,null,"","",{"$f":"IFERROR(IF(F76=\"\",\"\",VLOOKUP(F76,'10. Condition and Temporal'!$B$6:$F$103,5,FALSE)), \"Error ▲\")","v":""},null,"","",{"$nulls":6},"","","","","",{"$nulls":3},"","","","","",{"$f":"IF(D76=\"\",\"\",VLOOKUP(F76,'9. All Habitats + Multipliers'!$C$4:$K$102,5,FALSE))","v":""},{"$f":"IF(AG76=\"\",\"\",VLOOKUP(AG76,'11. Lists'!$S$47:$U$50,2,FALSE))","v":""},"",{"$f":"IF(AI76=\"\",\"\",VLOOKUP(AI76,'11. Lists'!$F$47:$G$51,2,FALSE))","v":""},{"$nulls":3},"",{"$f":"IF(AN76=\"\",\"\",VLOOKUP(AN76,'11. Lists'!$F$36:$H$38,2,FALSE))","v":""},{"$f":"IF(AN76=\"\",\"\",VLOOKUP(AN76,'11. Lists'!$F$36:$H$38,3,FALSE))","v":""},{"$f":"IF(D76=\"\",\"\",IF(AX76=\"Distinctiveness\",\"N/A\",VLOOKUP(F76,'10. Condition and Temporal'!$B$6:$L$103,11,FALSE)))","v":""},{"$f":"IF(AQ76=\"\",\"\",IF(AQ76=\"N/A\",\"1\",VLOOKUP(AQ76,'11. Lists'!$I$47:$K$80,3,FALSE)))","v":""},{"$f":"IF(D76=\"\",\"\",IF(AX76=\"Condition\",\"N/A\",VLOOKUP(F76,'10. Condition and Temporal'!$B$6:$M$106,12,FALSE)))","v":""},{"$f":"IF(AS76=\"\",\"\",IF(AS76=\"N/A\",\"1\",VLOOKUP(AS76,'11. Lists'!$I$47:$K$80,3,FALSE)))","v":""},{"$f":"IF(D76=\"\",\"\",VLOOKUP(F76,'9. All Habitats + Multipliers'!$C$4:$K$102,8,FALSE))","v":""},{"$f":"IF(AU76=\"\",\"\",VLOOKUP(AU76,'11. Lists'!$J$35:$K$38,2,FALSE))","v":""},{"$f":"IF(D76=\"\",\"\",VLOOKUP(D76,'10. Condition and Temporal'!$B$6:$M$103,4,FALSE))","v":""},"",null,null,11,"","","","","","","","","","","","","","","","","","","","","","BL",{"$f":"BL64","v":0}]
[null,12,"","","",null,null,"","",{"$f":"IFERROR(IF(F77=\"\",\"\",VLOOKUP(F77,'10. Condition and Temporal'!$B$6:$F$103,5,FALSE)), \"Error ▲\")","v":""},null,"","",{"$nulls":6},"","","","","",{"$nulls":3},"","","","","",{"$f":"IF(D77=\"\",\"\",VLOOKUP(F77,'9. All Habitats + Multipliers'!$C$4:$K$102,5,FALSE))","v":""},{"$f":"IF(AG77=\"\",\"\",VLOOKUP(AG77,'11. Lists'!$S$47:$U$50,2,FALSE))","v":""},"",{"$f":"IF(AI77=\"\",\"\",VLOOKUP(AI77,'11. Lists'!$F$47:$G$51,2,FALSE))","v":""},{"$nulls":3},"",{"$f":"IF(AN77=\"\",\"\",VLOOKUP(AN77,'11. Lists'!$F$36:$H$38,2,FALSE))","v":""},{"$f":"IF(AN77=\"\",\"\",VLOOKUP(AN77,'11. Lists'!$F$36:$H$38,3,FALSE))","v":""},{"$f":"IF(D77=\"\",\"\",IF(AX77=\"Distinctiveness\",\"N/A\",VLOOKUP(F77,'10. Condition and Temporal'!$B$6:$L$103,11,FALSE)))","v":""},{"$f":"IF(AQ77=\"\",\"\",IF(AQ77=\"N/A\",\"1\",VLOOKUP(AQ77,'11. Lists'!$I$47:$K$80,3,FALSE)))","v":""},{"$f":"IF(D77=\"\",\"\",IF(AX77=\"Condition\",\"N/A\",VLOOKUP(F77,'10. Condition and Temporal'!$B$6:$M$106,12,FALSE)))","v":""},{"$f":"IF(AS77=\"\",\"\",IF(AS77=\"N/A\",\"1\",VLOOKUP(AS77,'11. Lists'!$I$47:$K$80,3,FALSE)))","v":""},{"$f":"IF(D77=\"\",\"\",VLOOKUP(F77,'9. All Habitats + Multipliers'!$C$4:$K$102,8,FALSE))","v":""},{"$f":"IF(AU77=\"\",\"\",VLOOKUP(AU77,'11. Lists'!$J$35:$K$38,2,FALSE))","v":""},{"$f":"IF(D77=\"\",\"\",VLOOKUP(D77,'10. Condition and Temporal'!$B$6:$M$103,4,FALSE))","v":""},"",null,null,12,"","","","","","","","","","","","","","","","","","","","","","BM",{"$f":"BM64","v":0}]
[null,13,"","","",null,null,"","",{"$f":"IFERROR(IF(F78=\"\",\"\",VLOOKUP(F78,'10. Condition and Temporal'!$B$6:$F$103,5,FALSE)), \"Error ▲\")","v":""},null,{"$f":"IFERROR(IF(D78=\"\",\"\",IF(AX78=\"Distinctiveness\",(((((I78*AH78*AJ78)-(I78*V78*X78))*(AV78*AT78))+(I78*V78*X78))*AP78/1000),((((I78*AH78*AJ78)-(I78*V78*X78))*(AV78*AR78))+(I78*V78*X78))*AP78/1000)),\"This intervention is not permitted within the SSM ▲\")","v":""},"",{"$nulls":6},"","","","","",{"$nulls":3},"","","","","",{"$f":"IF(D78=\"\",\"\",VLOOKUP(F78,'9. All Habitats + Multipliers'!$C$4:$K$102,5,FALSE))","v":""},{"$f":"IF(AG78=\"\",\"\",VLOOKUP(AG78,'11. Lists'!$S$47:$U$50,2,FALSE))","v":""},"",{"$f":"IF(AI78=\"\",\"\",VLOOKUP(AI78,'11. Lists'!$F$47:$G$51,2,FALSE))","v":""},{"$nulls":3},"",{"$f":"IF(AN78=\"\",\"\",VLOOKUP(AN78,'11. Lists'!$F$36:$H$38,2,FALSE))","v":""},{"$f":"IF(AN78=\"\",\"\",VLOOKUP(AN78,'11. Lists'!$F$36:$H$38,3,FALSE))","v":""},{"$f":"IF(D78=\"\",\"\",IF(AX78=\"Distinctiveness\",\"N/A\",VLOOKUP(F78,'10. Condition and Temporal'!$B$6:$L$103,11,FALSE)))","v":""},{"$f":"IF(AQ78=\"\",\"\",IF(AQ78=\"N/A\",\"1\",VLOOKUP(AQ78,'11. Lists'!$I$47:$K$80,3,FALSE)))","v":""},{"$f":"IF(D78=\"\",\"\",IF(AX78=\"Condition\",\"N/A\",VLOOKUP(F78,'10. Condition and Temporal'!$B$6:$M$106,12,FALSE)))","v":""},{"$f":"IF(AS78=\"\",\"\",IF(AS78=\"N/A\",\"1\",VLOOKUP(AS78,'11. Lists'!$I$47:$K$80,3,FALSE)))","v":""},{"$f":"IF(D78=\"\",\"\",VLOOKUP(F78,'9. All Habitats + Multipliers'!$C$4:$K$102,8,FALSE))","v":""},{"$f":"IF(AU78=\"\",\"\",VLOOKUP(AU78,'11. Lists'!$J$35:$K$38,2,FALSE))","v":""},{"$f":"IF(D78=\"\",\"\",VLOOKUP(D78,'10. Condition and Temporal'!$B$6:$M$103,4,FALSE))","v":""},"",null,null,13,"","","","","","","","","","","","","","","","","","","","","","BN",{"$f":"BN64","v":0}]
[null,14,"","","",null,null,"","",{"$f":"IFERROR(IF(F79=\"\",\"\",VLOOKUP(F79,'10. Condition and Temporal'!$B$6:$F$103,5,FALSE)), \"Error ▲\")","v":""},null,"","",{"$nulls":6},"","","","","",{"$nulls":3},"","","","","",{"$f":"IF(D79=\"\",\"\",VLOOKUP(F79,'9. All Habitats + Multipliers'!$C$4:$K$102,5,FALSE))","v":""},{"$f":"IF(AG79=\"\",\"\",VLOOKUP(AG79,'11. Lists'!$S$47:$U$50,2,FALSE))","v":""},"",{"$f":"IF(AI79=\"\",\"\",VLOOKUP(AI79,'11. Lists'!$F$47:$G$51,2,FALSE))","v":""},{"$nulls":3},"",{"$f":"IF(AN79=\"\",\"\",VLOOKUP(AN79,'11. Lists'!$F$36:$H$38,2,FALSE))","v":""},{"$f":"IF(AN79=\"\",\"\",VLOOKUP(AN79,'11. Lists'!$F$36:$H$38,3,FALSE))","v":""},{"$f":"IF(D79=\"\",\"\",IF(AX79=\"Distinctiveness\",\"N/A\",VLOOKUP(F79,'10. Condition and Temporal'!$B$6:$L$103,11,FALSE)))","v":""},{"$f":"IF(AQ79=\"\",\"\",IF(AQ79=\"N/A\",\"1\",VLOOKUP(AQ79,'11. Lists'!$I$47:$K$80,3,FALSE)))","v":""},{"$f":"IF(D79=\"\",\"\",IF(AX79=\"Condition\",\"N/A\",VLOOKUP(F79,'10. Condition and Temporal'!$B$6:$M$106,12,FALSE)))","v":""},{"$f":"IF(AS79=\"\",\"\",IF(AS79=\"N/A\",\"1\",VLOOKUP(AS79,'11. Lists'!$I$47:$K$80,3,FALSE)))","v":""},{"$f":"IF(D79=\"\",\"\",VLOOKUP(F79,'9. All Habitats + Multipliers'!$C$4:$K$102,8,FALSE))","v":""},{"$f":"IF(AU79=\"\",\"\",VLOOKUP(AU79,'11. Lists'!$J$35:$K$38,2,FALSE))","v":""},{"$f":"IF(D79=\"\",\"\",VLOOKUP(D79,'10. Condition and Temporal'!$B$6:$M$103,4,FALSE))","v":""},"",null,null,14,"","","","","","","","","","","","","","","","","","","","","","BO",{"$f":"BO64","v":0}]
[null,15,"","","",null,null,"","",{"$f":"IFERROR(IF(F80=\"\",\"\",VLOOKUP(F80,'10. Condition and Temporal'!$B$6:$F$103,5,FALSE)), \"Error ▲\")","v":""},null,"","",{"$nulls":6},"","","","","",{"$nulls":3},"","","","","",{"$f":"IF(D80=\"\",\"\",VLOOKUP(F80,'9. All Habitats + Multipliers'!$C$4:$K$102,5,FALSE))","v":""},{"$f":"IF(AG80=\"\",\"\",VLOOKUP(AG80,'11. Lists'!$S$47:$U$50,2,FALSE))","v":""},"",{"$f":"IF(AI80=\"\",\"\",VLOOKUP(AI80,'11. Lists'!$F$47:$G$51,2,FALSE))","v":""},{"$nulls":3},"",{"$f":"IF(AN80=\"\",\"\",VLOOKUP(AN80,'11. Lists'!$F$36:$H$38,2,FALSE))","v":""},{"$f":"IF(AN80=\"\",\"\",VLOOKUP(AN80,'11. Lists'!$F$36:$H$38,3,FALSE))","v":""},{"$f":"IF(D80=\"\",\"\",IF(AX80=\"Distinctiveness\",\"N/A\",VLOOKUP(F80,'10. Condition and Temporal'!$B$6:$L$103,11,FALSE)))","v":""},{"$f":"IF(AQ80=\"\",\"\",IF(AQ80=\"N/A\",\"1\",VLOOKUP(AQ80,'11. Lists'!$I$47:$K$80,3,FALSE)))","v":""},{"$f":"IF(D80=\"\",\"\",IF(AX80=\"Condition\",\"N/A\",VLOOKUP(F80,'10. Condition and Temporal'!$B$6:$M$106,12,FALSE)))","v":""},{"$f":"IF(AS80=\"\",\"\",IF(AS80=\"N/A\",\"1\",VLOOKUP(AS80,'11. Lists'!$I$47:$K$80,3,FALSE)))","v":""},{"$f":"IF(D80=\"\",\"\",VLOOKUP(F80,'9. All Habitats + Multipliers'!$C$4:$K$102,8,FALSE))","v":""},{"$f":"IF(AU80=\"\",\"\",VLOOKUP(AU80,'11. Lists'!$J$35:$K$38,2,FALSE))","v":""},{"$f":"IF(D80=\"\",\"\",VLOOKUP(D80,'10. Condition and Temporal'!$B$6:$M$103,4,FALSE))","v":""},"",null,null,15,"","","","","","","","","","","","","","","","","","","","","","BP",{"$f":"BP64","v":0}]
[null,16,"","","",null,null,"","",{"$f":"IFERROR(IF(F81=\"\",\"\",VLOOKUP(F81,'10. Condition and Temporal'!$B$6:$F$103,5,FALSE)), \"Error ▲\")","v":""},null,"","",{"$nulls":6},"","","","","",{"$nulls":3},"","","","","",{"$f":"IF(D81=\"\",\"\",VLOOKUP(F81,'9. All Habitats + Multipliers'!$C$4:$K$102,5,FALSE))","v":""},{"$f":"IF(AG81=\"\",\"\",VLOOKUP(AG81,'11. Lists'!$S$47:$U$50,2,FALSE))","v":""},"",{"$f":"IF(AI81=\"\",\"\",VLOOKUP(AI81,'11. Lists'!$F$47:$G$51,2,FALSE))","v":""},{"$nulls":3},"",{"$f":"IF(AN81=\"\",\"\",VLOOKUP(AN81,'11. Lists'!$F$36:$H$38,2,FALSE))","v":""},{"$f":"IF(AN81=\"\",\"\",VLOOKUP(AN81,'11. Lists'!$F$36:$H$38,3,FALSE))","v":""},{"$f":"IF(D81=\"\",\"\",IF(AX81=\"Distinctiveness\",\"N/A\",VLOOKUP(F81,'10. Condition and Temporal'!$B$6:$L$103,11,FALSE)))","v":""},{"$f":"IF(AQ81=\"\",\"\",IF(AQ81=\"N/A\",\"1\",VLOOKUP(AQ81,'11. Lists'!$I$47:$K$80,3,FALSE)))","v":""},{"$f":"IF(D81=\"\",\"\",IF(AX81=\"Condition\",\"N/A\",VLOOKUP(F81,'10. Condition and Temporal'!$B$6:$M$106,12,FALSE)))","v":""},{"$f":"IF(AS81=\"\",\"\",IF(AS81=\"N/A\",\"1\",VLOOKUP(AS81,'11. Lists'!$I$47:$K$80,3,FALSE)))","v":""},{"$f":"IF(D81=\"\",\"\",VLOOKUP(F81,'9. All Habitats + Multipliers'!$C$4:$K$102,8,FALSE))","v":""},{"$f":"IF(AU81=\"\",\"\",VLOOKUP(AU81,'11. Lists'!$J$35:$K$38,2,FALSE))","v":""},{"$f":"IF(D81=\"\",\"\",VLOOKUP(D81,'10. Condition and Temporal'!$B$6:$M$103,4,FALSE))","v":""},"",null,null,16,"","","","","","","","","","","","","","","","","","","","","","BQ",{"$f":"BQ64","v":0}]
[null,17,"","","",null,null,"","",{"$f":"IFERROR(IF(F82=\"\",\"\",VLOOKUP(F82,'10. Condition and Temporal'!$B$6:$F$103,5,FALSE)), \"Error ▲\")","v":""},null,"","",{"$nulls":6},"","","","","",{"$nulls":3},"","","","","",{"$f":"IF(D82=\"\",\"\",VLOOKUP(F82,'9. All Habitats + Multipliers'!$C$4:$K$102,5,FALSE))","v":""},{"$f":"IF(AG82=\"\",\"\",VLOOKUP(AG82,'11. Lists'!$S$47:$U$50,2,FALSE))","v":""},"",{"$f":"IF(AI82=\"\",\"\",VLOOKUP(AI82,'11. Lists'!$F$47:$G$51,2,FALSE))","v":""},{"$nulls":3},"",{"$f":"IF(AN82=\"\",\"\",VLOOKUP(AN82,'11. Lists'!$F$36:$H$38,2,FALSE))","v":""},{"$f":"IF(AN82=\"\",\"\",VLOOKUP(AN82,'11. Lists'!$F$36:$H$38,3,FALSE))","v":""},{"$f":"IF(D82=\"\",\"\",IF(AX82=\"Distinctiveness\",\"N/A\",VLOOKUP(F82,'10. Condition and Temporal'!$B$6:$L$103,11,FALSE)))","v":""},{"$f":"IF(AQ82=\"\",\"\",IF(AQ82=\"N/A\",\"1\",VLOOKUP(AQ82,'11. Lists'!$I$47:$K$80,3,FALSE)))","v":""},{"$f":"IF(D82=\"\",\"\",IF(AX82=\"Condition\",\"N/A\",VLOOKUP(F82,'10. Condition and Temporal'!$B$6:$M$106,12,FALSE)))","v":""},{"$f":"IF(AS82=\"\",\"\",IF(AS82=\"N/A\",\"1\",VLOOKUP(AS82,'11. Lists'!$I$47:$K$80,3,FALSE)))","v":""},{"$f":"IF(D82=\"\",\"\",VLOOKUP(F82,'9. All Habitats + Multipliers'!$C$4:$K$102,8,FALSE))","v":""},{"$f":"IF(AU82=\"\",\"\",VLOOKUP(AU82,'11. Lists'!$J$35:$K$38,2,FALSE))","v":""},{"$f":"IF(D82=\"\",\"\",VLOOKUP(D82,'10. Condition and Temporal'!$B$6:$M$103,4,FALSE))","v":""},"",null,null,17,"","","","","","","","","","","","","","","","","","","","","","BR",{"$f":"BR64","v":0}]
[null,18,"","","",null,null,"","",{"$f":"IFERROR(IF(F83=\"\",\"\",VLOOKUP(F83,'10. Condition and Temporal'!$B$6:$F$103,5,FALSE)), \"Error ▲\")","v":""},null,"","",{"$nulls":6},"","","","","",{"$nulls":3},"","","","","",{"$f":"IF(D83=\"\",\"\",VLOOKUP(F83,'9. All Habitats + Multipliers'!$C$4:$K$102,5,FALSE))","v":""},{"$f":"IF(AG83=\"\",\"\",VLOOKUP(AG83,'11. Lists'!$S$47:$U$50,2,FALSE))","v":""},"",{"$f":"IF(AI83=\"\",\"\",VLOOKUP(AI83,'11. Lists'!$F$47:$G$51,2,FALSE))","v":""},{"$nulls":3},"",{"$f":"IF(AN83=\"\",\"\",VLOOKUP(AN83,'11. Lists'!$F$36:$H$38,2,FALSE))","v":""},{"$f":"IF(AN83=\"\",\"\",VLOOKUP(AN83,'11. Lists'!$F$36:$H$38,3,FALSE))","v":""},{"$f":"IF(D83=\"\",\"\",IF(AX83=\"Distinctiveness\",\"N/A\",VLOOKUP(F83,'10. Condition and Temporal'!$B$6:$L$103,11,FALSE)))","v":""},{"$f":"IF(AQ83=\"\",\"\",IF(AQ83=\"N/A\",\"1\",VLOOKUP(AQ83,'11. Lists'!$I$47:$K$80,3,FALSE)))","v":""},{"$f":"IF(D83=\"\",\"\",IF(AX83=\"Condition\",\"N/A\",VLOOKUP(F83,'10. Condition and Temporal'!$B$6:$M$106,12,FALSE)))","v":""},{"$f":"IF(AS83=\"\",\"\",IF(AS83=\"N/A\",\"1\",VLOOKUP(AS83,'11. Lists'!$I$47:$K$80,3,FALSE)))","v":""},{"$f":"IF(D83=\"\",\"\",VLOOKUP(F83,'9. All Habitats + Multipliers'!$C$4:$K$102,8,FALSE))","v":""},{"$f":"IF(AU83=\"\",\"\",VLOOKUP(AU83,'11. Lists'!$J$35:$K$38,2,FALSE))","v":""},{"$f":"IF(D83=\"\",\"\",VLOOKUP(D83,'10. Condition and Temporal'!$B$6:$M$103,4,FALSE))","v":""},"",null,null,18,"","","","","","","","","","","","","","","","","","","","","","BS",{"$f":"BS64","v":0}]
[null,19,"","","",null,null,"","",{"$f":"IFERROR(IF(F84=\"\",\"\",VLOOKUP(F84,'10. Condition and Temporal'!$B$6:$F$103,5,FALSE)), \"Error ▲\")","v":""},null,"","",{"$nulls":6},"","","","","",{"$nulls":3},"","","","","",{"$f":"IF(D84=\"\",\"\",VLOOKUP(F84,'9. All Habitats + Multipliers'!$C$4:$K$102,5,FALSE))","v":""},{"$f":"IF(AG84=\"\",\"\",VLOOKUP(AG84,'11. Lists'!$S$47:$U$50,2,FALSE))","v":""},"",{"$f":"IF(AI84=\"\",\"\",VLOOKUP(AI84,'11. Lists'!$F$47:$G$51,2,FALSE))","v":""},{"$nulls":3},"",{"$f":"IF(AN84=\"\",\"\",VLOOKUP(AN84,'11. Lists'!$F$36:$H$38,2,FALSE))","v":""},{"$f":"IF(AN84=\"\",\"\",VLOOKUP(AN84,'11. Lists'!$F$36:$H$38,3,FALSE))","v":""},{"$f":"IF(D84=\"\",\"\",IF(AX84=\"Distinctiveness\",\"N/A\",VLOOKUP(F84,'10. Condition and Temporal'!$B$6:$L$103,11,FALSE)))","v":""},{"$f":"IF(AQ84=\"\",\"\",IF(AQ84=\"N/A\",\"1\",VLOOKUP(AQ84,'11. Lists'!$I$47:$K$80,3,FALSE)))","v":""},{"$f":"IF(D84=\"\",\"\",IF(AX84=\"Condition\",\"N/A\",VLOOKUP(F84,'10. Condition and Temporal'!$B$6:$M$106,12,FALSE)))","v":""},{"$f":"IF(AS84=\"\",\"\",IF(AS84=\"N/A\",\"1\",VLOOKUP(AS84,'11. Lists'!$I$47:$K$80,3,FALSE)))","v":""},{"$f":"IF(D84=\"\",\"\",VLOOKUP(F84,'9. All Habitats + Multipliers'!$C$4:$K$102,8,FALSE))","v":""},{"$f":"IF(AU84=\"\",\"\",VLOOKUP(AU84,'11. Lists'!$J$35:$K$38,2,FALSE))","v":""},{"$f":"IF(D84=\"\",\"\",VLOOKUP(D84,'10. Condition and Temporal'!$B$6:$M$103,4,FALSE))","v":""},"",null,null,19,"","","","","","","","","","","","","","","","","","","","","","BT",{"$f":"BT64","v":0}]
[null,20,"","","",null,null,"","",{"$f":"IFERROR(IF(F85=\"\",\"\",VLOOKUP(F85,'10. Condition and Temporal'!$B$6:$F$103,5,FALSE)), \"Error ▲\")","v":""},null,"","",{"$nulls":6},"","","","","",{"$nulls":3},"","","","","",{"$f":"IF(D85=\"\",\"\",VLOOKUP(F85,'9. All Habitats + Multipliers'!$C$4:$K$102,5,FALSE))","v":""},{"$f":"IF(AG85=\"\",\"\",VLOOKUP(AG85,'11. Lists'!$S$47:$U$50,2,FALSE))","v":""},"",{"$f":"IF(AI85=\"\",\"\",VLOOKUP(AI85,'11. Lists'!$F$47:$G$51,2,FALSE))","v":""},{"$nulls":3},"",{"$f":"IF(AN85=\"\",\"\",VLOOKUP(AN85,'11. Lists'!$F$36:$H$38,2,FALSE))","v":""},{"$f":"IF(AN85=\"\",\"\",VLOOKUP(AN85,'11. Lists'!$F$36:$H$38,3,FALSE))","v":""},{"$f":"IF(D85=\"\",\"\",IF(AX85=\"Distinctiveness\",\"N/A\",VLOOKUP(F85,'10. Condition and Temporal'!$B$6:$L$103,11,FALSE)))","v":""},{"$f":"IF(AQ85=\"\",\"\",IF(AQ85=\"N/A\",\"1\",VLOOKUP(AQ85,'11. Lists'!$I$47:$K$80,3,FALSE)))","v":""},{"$f":"IF(D85=\"\",\"\",IF(AX85=\"Condition\",\"N/A\",VLOOKUP(F85,'10. Condition and Temporal'!$B$6:$M$106,12,FALSE)))","v":""},{"$f":"IF(AS85=\"\",\"\",IF(AS85=\"N/A\",\"1\",VLOOKUP(AS85,'11. Lists'!$I$47:$K$80,3,FALSE)))","v":""},{"$f":"IF(D85=\"\",\"\",VLOOKUP(F85,'9. All Habitats + Multipliers'!$C$4:$K$102,8,FALSE))","v":""},{"$f":"IF(AU85=\"\",\"\",VLOOKUP(AU85,'11. Lists'!$J$35:$K$38,2,FALSE))","v":""},{"$f":"IF(D85=\"\",\"\",VLOOKUP(D85,'10. Condition and Temporal'!$B$6:$M$103,4,FALSE))","v":""},"",null,null,20,"","","","","","","","","","","","","","","","","","","","","","BU",{"$f":"BU64","v":0}]
[{"$nulls":7},"Totals",{"$f":"SUM(I66:I85)","v":{"v":0,"d":"0.00"}},null,null,{"$f":"SUM(L66:L85)","v":{"v":0,"d":"0.0000"}},{"$f":"SUM(M66:N85)","v":{"v":0,"d":"0.0000"}}]
[]
[]
[]
[]
["Data beyond this row is automated"]
[]
[]
[]
[null,"1e . Trading Summary"]
[]
[null,"Distinctiveness and Habitat Type",null,null,{"$f":"IF(OR(H103:H113=\"No ▲\"),\"Error - Trading Rules Not Satisfied ▲\",\"Trading Rules Satisfied ✓\")","v":"Trading Rules Satisfied ✓"},{"$nulls":4},{"$f":"IFERROR(FIND(\"Error\",E97),0)","v":0}]
[]
[null,"1f . Habitat trading assessment"]
[]
[]
[null,"Broad habitat type","Distinctiveness","Habitat type","Baseline units","Onsite provision","Net change","Trading satisfied?"]
[null,"Hedgerows and Lines of trees","Medium","Species-rich native hedgerow",{"$f":"SUMIF($D$11:$E$30,D103,$L$11:$L$30)","v":{"v":0,"d":"0.0000"}},{"$f":"IF($I$31+$I$59+$I$86=0,0,SUMIF($D$39:$D$58,D103,$L$39:$N$58)+SUMIF($F$66:$G$85,D103,$L$66:$L$85)+SUMIF($D$11:$E$30,D103,$AE$11:$AE$30))","v":{"v":0,"d":"0.0000"}},{"$f":"$F$103-$E$103","v":{"v":0,"d":"0.0000"}},{"$f":"IF(G108>=0, \"Yes ✓\", \"No ▲\")","v":"Yes ✓"}]
[{"$nulls":3},"Native hedgerow - associated with bank or ditch",{"$f":"SUMIF($D$11:$E$30,D104,$L$11:$L$30)","v":{"v":0,"d":"0.0000"}},{"$f":"IF($I$31+$I$59+$I$86=0,0,SUMIF($D$39:$D$58,D104,$L$39:$N$58)+SUMIF($F$66:$G$85,D104,$L$66:$L$85)+SUMIF($D$11:$E$30,D104,$AE$11:$AE$30))","v":{"v":0,"d":"0.0000"}},{"$f":"$F$104-$E$104","v":{"v":0,"d":"0.0000"}}]
[{"$nulls":3},"Native hedgerow with trees",{"v":0,"d":"0.0000"},{"v":0,"d":"0.0000"},{"$f":"$F$105-$E$105","v":{"v":0,"d":"0.0000"}}]
[{"$nulls":3},"Ecologically valuable line of trees",{"v":0,"d":"0.0000"},{"v":0,"d":"0.0000"},{"$f":"$F$106-$E$106","v":{"v":0,"d":"0.0000"}}]
[{"$nulls":3},"Ecologically valuable line of trees - associated with bank or ditch",{"v":0,"d":"0.0000"},{"v":0,"d":"0.0000"},{"$f":"$F$107-$E$107","v":{"v":0,"d":"0.0000"}}]
[{"$nulls":3},"Sum",{"$f":"SUM($E$103:$E$107)","v":{"v":0,"d":"0.0000"}},{"$f":"SUM($F$103:$F$107)","v":{"v":0,"d":"0.0000"}},{"$f":"SUM($G$103:$G$107)","v":{"v":0,"d":"0.0000"}},null,{"$f":"IF($H$103=\"No ▲\",1,0)","v":0}]
[null,null,"Low","Native hedgerow",{"v":0,"d":"0.0000"},{"v":0.05086538813460001,"d":"0.0509"},{"$f":"$F$109-$E$109","v":{"v":0.05086538813460001,"d":"0.0509"}},{"$f":"IF(G112>=0,\"Yes ✓\",IF(E114>=0,\"Yes ✓\",\"No ▲\"))","v":"Yes ✓"}]
[{"$nulls":3},"Line of trees",{"v":0,"d":"0.0000"},{"v":0,"d":"0.0000"},{"$f":"$F$110-$E$110","v":{"v":0,"d":"0.0000"}}]
[{"$nulls":3},"Line of trees - associated with bank or ditch",{"v":0,"d":"0.0000"},{"v":0,"d":"0.0000"},{"$f":"$F$111-$E$111","v":{"v":0,"d":"0.0000"}}]
[{"$nulls":3},"Sum",{"$f":"SUM($E$109:$E$111)","v":{"v":0,"d":"0.0000"}},{"$f":"SUM($F$109:$F$111)","v":{"v":0.05086538813460001,"d":"0.0509"}},{"$f":"SUM($G$109:$G$111)","v":{"v":0.05086538813460001,"d":"0.0509"}},null,{"$f":"IF($H$109=\"No ▲\",1,0)","v":0}]
[null,null,"Very low","Non-native and ornamental hedgerow",{"v":0,"d":"0.0000"},{"v":0,"d":"0.0000"},{"$f":"$F$113-$E$113","v":{"v":0,"d":"0.0000"}},{"$f":"IF(G113>=0,\"Yes✓\",IF(F114>=0,\"Yes ✓\",\"No ▲\"))","v":"Yes✓"},{"$f":"IF($H$113=\"No ▲\",1,0)","v":0}]
[{"$nulls":4},{"$f":"G108+G112","v":{"v":0.05086538813460001,"d":"0.0509"}},{"$f":"IF(G108<0,0,($G$108+$G$112+$G$113))","v":0.05086538813460001}]
[null,"Surplus medium distinctiveness units to offset low and very low distinctiveness units",{"$nulls":3},{"$f":"$G$108","v":{"v":0,"d":"0.0000"}},{"$f":"IF($G$108<=0,0,($G$108+$G$112))","v":0}]
[null,"Cumulative surplus of units after offsetting low distinctiveness units",{"$nulls":3},{"$f":"IF($G$108>0,($G$112+$G$108),$G$112)","v":{"v":0.05086538813460001,"d":"0.0509"}},{"$f":"IF($G$108<=0,0,($G$108+$G$112+$G$113))","v":0}]
[null,"Cumulative surplus of units after offsetting very low distinctiveness units",{"$nulls":3},{"$f":"IF($F$116>0,($F$116+$G$113),$G$113)","v":{"v":0.05086538813460001,"d":"0.0509"}}]

{"sheet":"7. Watercourses","index":6,"n_rows":109,"n_cols":76,"rows_kept":109,"merged":[[0,17,30,17],[1,2,1,3],[1,5,5,7],[1,9,4,12],[2,2,2,3],[8,1,9,1],[8,2,8,4],[8,5,9,7],[8,8,8,10],[8,11,8,13],[8,14,8,15],[8,19,8,21],[8,22,8,23],[8,24,8,26],[8,27,8,29],[8,30,8,32],[8,33,9,33],[8,34,9,34],[8,35,9,35],[9,3,9,4],[9,19,9,20],[10,3,10,4],[10,5,10,7],[10,19,10,20],[11,3,11,4],[11,5,11,7],[11,19,11,20],[12,3,12,4],[12,5,12,7],[12,19,12,20],[13,3,13,4],[13,5,13,7],[13,19,13,20],[14,3,14,4],[14,5,14,7],[14,19,14,20],[15,3,15,4],[15,5,15,7],[15,19,15,20],[16,3,16,4],[16,5,16,7],[16,19,16,20],[17,3,17,4],[17,5,17,7],[17,19,17,20],[18,3,18,4],[18,5,18,7],[18,19,18,20],[19,3,19,4],[19,5,19,7],[19,19,19,20],[20,3,20,4],[20,5,20,7],[20,19,20,20],[21,3,21,4],[21,5,21,7],[21,19,21,20],[22,3,22,4],[22,5,22,7],[22,19,22,20],[23,3,23,4],[23,5,23,7],[23,19,23,20],[24,3,24,4],[24,5,24,7],[24,19,24,20],[25,3,25,4],[25,5,25,7],[25,19,25,20],[26,3,26,4],[26,5,26,7],[26,19,26,20],[27,3,27,4],[27,5,27,7],[27,19,27,20],[28,3,28,4],[28,5,28,7],[28,19,28,20],[29,3,29,4],[29,5,29,7],[29,19,29,20],[31,8,31,13],[32,8,32,13],[33,17,61,17],[36,1,37,1],[36,2,36,3],[36,4,36,6],[36,7,37,7],[36,8,37,10],[36,11,37,13],[36,14,36,15],[36,19,36,21],[36,22,36,23],[36,24,36,26],[36,27,36,29],[36,30,36,31],[36,32,36,33],[36,34,37,34],[37,5,37,6],[37,19,37,20],[38,5,38,6],[38,8,38,10],[38,11,38,13],[38,19,38,20],[39,5,39,6],[39,8,39,10],[39,11,39,13],[39,19,39,20],[40,5,40,6],[40,8,40,10],[40,11,40,13],[40,19,40,20],[41,5,41,6],[41,8,41,10],[41,11,41,13],[41,19,41,20],[42,5,42,6],[42,8,42,10],[42,11,42,13],[42,19,42,20],[43,5,43,6],[43,8,43,10],[43,11,43,13],[43,19,43,20],[44,5,44,6],[44,8,44,10],[44,11,44,13],[44,19,44,20],[45,5,45,6],[45,8,45,10],[45,11,45,13],[45,19,45,20],[46,5,46,6],[46,8,46,10],[46,11,46,13],[46,19,46,20],[47,5,47,6],[47,8,47,10],[47,11,47,13],[47,19,47,20],[48,5,48,6],[48,8,48,10],[48,11,48,13],[48,19,48,20],[49,5,49,6],[49,8,49,10],[49,11,49,13],[49,19,49,20],[50,5,50,6],[50,8,50,10],[50,11,50,13],[50,19,50,20],[51,5,51,6],[51,8,51,10],[51,11,51,13],[51,19,51,20],[52,5,52,6],[52,8,52,10],[52,11,52,13],[52,19,52,20],[53,5,53,6],[53,8,53,10],[53,11,53,13],[53,19,53,20],[54,5,54,6],[54,8,54,10],[54,11,54,13],[54,19,54,20],[55,5,55,6],[55,8,55,10],[55,11,55,13],[55,19,55,20],[56,5,56,6],[56,8,56,10],[56,11,56,13],[56,19,56,20],[57,5,57,6],[57,8,57,10],[57,11,57,13],[57,19,57,20],[58,8,58,10],[58,11,58,13],[62,0,64,0],[62,17,87,17],[62,52,63,52],[63,1,64,1],[63,2,63,3],[63,4,63,6],[63,7,64,7],[63,8,64,8],[63,9,64,10],[63,11,64,11],[63,12,64,13],[63,14,63,15],[63,19,63,29],[63,30,64,30],[63,31,63,41],[63,42,64,42],[63,43,63,47],[64,5,64,6],[65,5,65,6],[65,9,65,10],[65,12,65,13],[66,5,66,6],[66,9,66,10],[66,12,66,13],[67,5,67,6],[67,9,67,10],[67,12,67,13],[68,5,68,6],[68,9,68,10],[68,12,68,13],[69,5,69,6],[69,9,69,10],[69,12,69,13],[70,5,70,6],[70,9,70,10],[70,12,70,13],[71,5,71,6],[71,9,71,10],[71,12,71,13],[72,5,72,6],[72,9,72,10],[72,12,72,13],[73,5,73,6],[73,9,73,10],[73,12,73,13],[74,5,74,6],[74,9,74,10],[74,12,74,13],[75,5,75,6],[75,9,75,10],[75,12,75,13],[76,5,76,6],[76,9,76,10],[76,12,76,13],[77,5,77,6],[77,9,77,10],[77,12,77,13],[78,5,78,6],[78,9,78,10],[78,12,78,13],[79,5,79,6],[79,9,79,10],[79,12,79,13],[80,5,80,6],[80,9,80,10],[80,12,80,13],[81,5,81,6],[81,9,81,10],[81,12,81,13],[82,5,82,6],[82,9,82,10],[82,12,82,13],[83,5,83,6],[83,9,83,10],[83,12,83,13],[84,5,84,6],[84,9,84,10],[84,12,84,13],[85,12,85,13],[88,17,96,17],[90,0,92,16],[96,2,96,3],[96,4,96,8],[97,17,99,17],[100,17,129,17],[102,2,105,2],[102,3,104,3],[102,8,104,8],[107,2,107,5],[108,2,108,5]]}
[{"$nulls":14},"Retained Units",{"$f":"IFERROR(SUM(AE11:AE30), \"Error ▲\")","v":{"v":0,"d":"0.0000"}},null,"Data beyond this column is automated"]
[null,"Site Name",{"$f":"IF('2. Site Details'!D4=\"\",\"Enter site name on 2. Site Details\",'2. Site Details'!D4)","v":" 'Glenside' 45 Windmill Lane, Alton, Hampshire GU34 2SN"},null,null,"Instructions:\n\n1. Enter data into 1a. Baseline habitats\n2. Enter data on habitats to be created into 1b. Habitats to be created\n3. Enter data on Habitats to be enhanced into 1c. Habitats to be enhanced\n",{"$nulls":3},{"$f":"IFERROR(IF(OR((ISNUMBER(SEARCH(\"▲\",A7:Q101)))),\"Input Errors Present On Sheet - Red Cells Or ▲ Highlight Errors\",\"All Key Rules Satisfied ✓ \"),\"Technical Errors On Sheet ▲\")","v":"All Key Rules Satisfied ✓ "},{"$nulls":4},"Lost Units",{"$f":"IFERROR(N31, \"Error ▲\")","v":{"v":0,"d":"0.0000"}}]
[null,"Sheet Name","7. Watercourses",{"$nulls":11},"Created Units",{"$f":"IFERROR(L59, \"Error ▲\")","v":{"v":0,"d":"0.0000"}}]
[{"$nulls":14},"Enhancement Units",{"$f":"IFERROR(L86, \"Error ▲\")","v":{"v":0,"d":"0.0000"}}]
[{"$nulls":14},"Net Change",{"$f":"IFERROR(P1+L59+L86-L31, \"Error ▲\")","v":{"v":0,"d":"0.0000"}}]
[]
[null,"1a. Baseline habitats"]
[]
[null,"Ref","Habitat",null,null,"C. Strategic significance",null,null,"Length M",null,null,"Baseline results",null,null,"Comments",{"$nulls":4},"Habitat distinctiveness",null,null,"Habitat condition",{"$nulls":4},"Strategic significance",null,null,"Ecological baseline",null,null,"Suggested action to address habitat losses","Enhancement rules","Baseline watercourse and riparian encroachment"]
[null,null,"A. Broad Habitat"," B. Habitat type",{"$nulls":4},"D. Total Length","E. Length retained","F. Length enhanced","Total  units onsite","Length Lost","Units lost","User comments","LPA comments",{"$nulls":3},"Distinctiveness",null,"Score","Condition ","Score",{"$nulls":3},"Strategic significance","Strategic significance","Strategic significance multiplier","Baseline units retained","Baseline units to be enhanced","Area lost",{"$nulls":10},"Baseline units pre-encroachment"]
[null,1,"Watercourses",{"$nulls":8},{"$f":"IF(D11=\"\",\"\",IFERROR(IF(I11=\"\",\"\",((I11/1000)*V11*X11)*AD11*AJ11),\"This intervention is not permitted within the SSM ▲\"))","v":""},{"$f":"IF(I11=\"\",\"\",IF(J11+K11>I11,\"Length Error ▲\",I11-J11-K11))","v":""},{"$f":"IFERROR(IF(I11=\"\",\"\",IF(M11=\"Length Error ▲\",\"Length Error ▲\",((M11/1000)*V11*X11)*AD11*AJ11)),\"This intervention is not permitted within the SSM ▲\")","v":""},{"$nulls":5},{"$f":"IF(D11=\"\",\"\",VLOOKUP(D11,'9. All Habitats + Multipliers'!$C$4:$K$102,5,FALSE))","v":""},null,{"$f":"IF(T11=\"\",\"\",VLOOKUP(T11,'11. Lists'!$B$47:$D$49,2,FALSE))","v":""},{"$f":"IF(D11=\"\",\"\",VLOOKUP(D11,'10. Condition and Temporal'!$B$6:$C$103,2,FALSE))","v":""},{"$f":"IF(W11=\"\",\"\",VLOOKUP(W11,'11. Lists'!$F$47:$G$51,2,FALSE))","v":""},{"$nulls":3},{"$f":"IF(F11=\"\",\"\",F11)","v":""},{"$f":"IF(AB11=\"\",\"\",VLOOKUP(AB11,'11. Lists'!$F$36:$H$38,2,FALSE))","v":""},{"$f":"IF(AB11=\"\",\"\",VLOOKUP(AB11,'11. Lists'!$F$36:$H$38,3,FALSE))","v":""},{"$f":"IF(D11=\"\",\"\",((J11/1000)*V11*X11)*AD11*AJ11)","v":""},{"$f":"IF(D11=\"\",\"\",((K11/1000)*V11*X11)*AD11*AJ11)","v":""},{"$f":"IF(D11=\"\",\"\",M11)","v":""},{"$f":"IF(T11=\"\",\"\",VLOOKUP(T11,'11. Lists'!$B$47:$D$49,3,FALSE))","v":""},{"$f":"IF(D11=\"\",\"\",VLOOKUP(D11,'10. Condition and Temporal'!$B$6:$L$103,4,FALSE))","v":""},{"$f":"IF($D$11:$E$30=\"Culvert\",\"0.68\",\"1\")","v":"1"},"1",{"$nulls":6},{"$f":"IF(D11=\"\",\"\",IFERROR(IF(I11=\"\",\"\",((I11/1000)*V11*X11)*AD11),\"This intervention is not permitted within the SSM ▲\"))","v":""}]
[null,2,"Watercourses",{"$nulls":8},{"$f":"IF(D12=\"\",\"\",IFERROR(IF(I12=\"\",\"\",((I12/1000)*V12*X12)*AD12*AJ12),\"This intervention is not permitted within the SSM ▲\"))","v":""},{"$f":"IF(I12=\"\",\"\",IF(J12+K12>I12,\"Length Error ▲\",I12-J12-K12))","v":""},{"$f":"IFERROR(IF(I12=\"\",\"\",IF(M12=\"Length Error ▲\",\"Length Error ▲\",((M12/1000)*V12*X12)*AD12*AJ12)),\"This intervention is not permitted within the SSM ▲\")","v":""},{"$nulls":5},{"$f":"IF(D12=\"\",\"\",VLOOKUP(D12,'9. All Habitats + Multipliers'!$C$4:$K$102,5,FALSE))","v":""},null,{"$f":"IF(T12=\"\",\"\",VLOOKUP(T12,'11. Lists'!$B$47:$D$49,2,FALSE))","v":""},{"$f":"IF(D12=\"\",\"\",VLOOKUP(D12,'10. Condition and Temporal'!$B$6:$C$103,2,FALSE))","v":""},{"$f":"IF(W12=\"\",\"\",VLOOKUP(W12,'11. Lists'!$F$47:$G$51,2,FALSE))","v":""},{"$nulls":3},{"$f":"IF(F12=\"\",\"\",F12)","v":""},{"$f":"IF(AB12=\"\",\"\",VLOOKUP(AB12,'11. Lists'!$F$36:$H$38,2,FALSE))","v":""},{"$f":"IF(AB12=\"\",\"\",VLOOKUP(AB12,'11. Lists'!$F$36:$H$38,3,FALSE))","v":""},{"$f":"IF(D12=\"\",\"\",((J12/1000)*V12*X12)*AD12*AJ12)","v":""},{"$f":"IF(D12=\"\",\"\",((K12/1000)*V12*X12)*AD12*AJ12)","v":""},{"$f":"IF(D12=\"\",\"\",M12)","v":""},{"$f":"IF(T12=\"\",\"\",VLOOKUP(T12,'11. Lists'!$B$47:$D$49,3,FALSE))","v":""},{"$f":"IF(D12=\"\",\"\",VLOOKUP(D12,'10. Condition and Temporal'!$B$6:$L$103,4,FALSE))","v":""},"1","1",{"$nulls":6},{"$f":"IF(D12=\"\",\"\",IFERROR(IF(I12=\"\",\"\",((I12/1000)*V12*X12)*AD12),\"This intervention is not permitted within the SSM ▲\"))","v":""}]
[null,3,"Watercourses",{"$nulls":8},"",{"$f":"IF(I13=\"\",\"\",IF(J13+K13>I13,\"Length Error ▲\",I13-J13-K13))","v":""},"",{"$nulls":5},{"$f":"IF(D13=\"\",\"\",VLOOKUP(D13,'9. All Habitats + Multipliers'!$C$4:$K$102,5,FALSE))","v":""},null,{"$f":"IF(T13=\"\",\"\",VLOOKUP(T13,'11. Lists'!$B$47:$D$49,2,FALSE))","v":""},{"$f":"IF(D13=\"\",\"\",VLOOKUP(D13,'10. Condition and Temporal'!$B$6:$C$103,2,FALSE))","v":""},{"$f":"IF(W13=\"\",\"\",VLOOKUP(W13,'11. Lists'!$F$47:$G$51,2,FALSE))","v":""},{"$nulls":3},{"$f":"IF(F13=\"\",\"\",F13)","v":""},{"$f":"IF(AB13=\"\",\"\",VLOOKUP(AB13,'11. Lists'!$F$36:$H$38,2,FALSE))","v":""},{"$f":"IF(AB13=\"\",\"\",VLOOKUP(AB13,'11. Lists'!$F$36:$H$38,3,FALSE))","v":""},"","","",{"$f":"IF(T13=\"\",\"\",VLOOKUP(T13,'11. Lists'!$B$47:$D$49,3,FALSE))","v":""},{"$f":"IF(D13=\"\",\"\",VLOOKUP(D13,'10. Condition and Temporal'!$B$6:$L$103,4,FALSE))","v":""},"1","1",{"$nulls":6},""]
[null,4,"Watercourses",{"$nulls":8},"","","",{"$nulls":5},{"$f":"IF(D14=\"\",\"\",VLOOKUP(D14,'9. All Habitats + Multipliers'!$C$4:$K$102,5,FALSE))","v":""},null,{"$f":"IF(T14=\"\",\"\",VLOOKUP(T14,'11. Lists'!$B$47:$D$49,2,FALSE))","v":""},{"$f":"IF(D14=\"\",\"\",VLOOKUP(D14,'10. Condition and Temporal'!$B$6:$C$103,2,FALSE))","v":""},{"$f":"IF(W14=\"\",\"\",VLOOKUP(W14,'11. Lists'!$F$47:$G$51,2,FALSE))","v":""},{"$nulls":3},"",{"$f":"IF(AB14=\"\",\"\",VLOOKUP(AB14,'11. Lists'!$F$36:$H$38,2,FALSE))","v":""},{"$f":"IF(AB14=\"\",\"\",VLOOKUP(AB14,'11. Lists'!$F$36:$H$38,3,FALSE))","v":""},"","","",{"$f":"IF(T14=\"\",\"\",VLOOKUP(T14,'11. Lists'!$B$47:$D$49,3,FALSE))","v":""},{"$f":"IF(D14=\"\",\"\",VLOOKUP(D14,'10. Condition and Temporal'!$B$6:$L$103,4,FALSE))","v":""},"1","1",{"$nulls":6},""]
[null,5,"Watercourses",{"$nulls":8},"","","",{"$nulls":5},{"$f":"IF(D15=\"\",\"\",VLOOKUP(D15,'9. All Habitats + Multipliers'!$C$4:$K$102,5,FALSE))","v":""},null,{"$f":"IF(T15=\"\",\"\",VLOOKUP(T15,'11. Lists'!$B$47:$D$49,2,FALSE))","v":""},{"$f":"IF(D15=\"\",\"\",VLOOKUP(D15,'10. Condition and Temporal'!$B$6:$C$103,2,FALSE))","v":""},{"$f":"IF(W15=\"\",\"\",VLOOKUP(W15,'11. Lists'!$F$47:$G$51,2,FALSE))","v":""},{"$nulls":3},"",{"$f":"IF(AB15=\"\",\"\",VLOOKUP(AB15,'11. Lists'!$F$36:$H$38,2,FALSE))","v":""},{"$f":"IF(AB15=\"\",\"\",VLOOKUP(AB15,'11. Lists'!$F$36:$H$38,3,FALSE))","v":""},"","","",{"$f":"IF(T15=\"\",\"\",VLOOKUP(T15,'11. Lists'!$B$47:$D$49,3,FALSE))","v":""},{"$f":"IF(D15=\"\",\"\",VLOOKUP(D15,'10. Condition and Temporal'!$B$6:$L$103,4,FALSE))","v":""},"1","1",{"$nulls":6},""]
[null,6,"Watercourses",{"$nulls":8},"","","",{"$nulls":5},{"$f":"IF(D16=\"\",\"\",VLOOKUP(D16,'9. All Habitats + Multipliers'!$C$4:$K$102,5,FALSE))","v":""},null,{"$f":"IF(T16=\"\",\"\",VLOOKUP(T16,'11. Lists'!$B$47:$D$49,2,FALSE))","v":""},{"$f":"IF(D16=\"\",\"\",VLOOKUP(D16,'10. Condition and Temporal'!$B$6:$C$103,2,FALSE))","v":""},{"$f":"IF(W16=\"\",\"\",VLOOKUP(W16,'11. Lists'!$F$47:$G$51,2,FALSE))","v":""},{"$nulls":3},"",{"$f":"IF(AB16=\"\",\"\",VLOOKUP(AB16,'11. Lists'!$F$36:$H$38,2,FALSE))","v":""},{"$f":"IF(AB16=\"\",\"\",VLOOKUP(AB16,'11. Lists'!$F$36:$H$38,3,FALSE))","v":""},"","","",{"$f":"IF(T16=\"\",\"\",VLOOKUP(T16,'11. Lists'!$B$47:$D$49,3,FALSE))","v":""},{"$f":"IF(D16=\"\",\"\",VLOOKUP(D16,'10. Condition and Temporal'!$B$6:$L$103,4,FALSE))","v":""},"1","1",{"$nulls":6},""]
[null,7,"Watercourses",{"$nulls":8},"","","",{"$nulls":5},{"$f":"IF(D17=\"\",\"\",VLOOKUP(D17,'9. All Habitats + Multipliers'!$C$4:$K$102,5,FALSE))","v":""},null,{"$f":"IF(T17=\"\",\"\",VLOOKUP(T17,'11. Lists'!$B$47:$D$49,2,FALSE))","v":""},{"$f":"IF(D17=\"\",\"\",VLOOKUP(D17,'10. Condition and Temporal'!$B$6:$C$103,2,FALSE))","v":""},{"$f":"IF(W17=\"\",\"\",VLOOKUP(W17,'11. Lists'!$F$47:$G$51,2,FALSE))","v":""},{"$nulls":3},"",{"$f":"IF(AB17=\"\",\"\",VLOOKUP(AB17,'11. Lists'!$F$36:$H$38,2,FALSE))","v":""},{"$f":"IF(AB17=\"\",\"\",VLOOKUP(AB17,'11. Lists'!$F$36:$H$38,3,FALSE))","v":""},"","","",{"$f":"IF(T17=\"\",\"\",VLOOKUP(T17,'11. Lists'!$B$47:$D$49,3,FALSE))","v":""},{"$f":"IF(D17=\"\",\"\",VLOOKUP(D17,'10. Condition and Temporal'!$B$6:$L$103,4,FALSE))","v":""},"1","1",{"$nulls":6},""]
[null,8,"Watercourses",{"$nulls":8},"","","",{"$nulls":5},{"$f":"IF(D18=\"\",\"\",VLOOKUP(D18,'9. All Habitats + Multipliers'!$C$4:$K$102,5,FALSE))","v":""},null,{"$f":"IF(T18=\"\",\"\",VLOOKUP(T18,'11. Lists'!$B$47:$D$49,2,FALSE))","v":""},{"$f":"IF(D18=\"\",\"\",VLOOKUP(D18,'10. Condition and Temporal'!$B$6:$C$103,2,FALSE))","v":""},{"$f":"IF(W18=\"\",\"\",VLOOKUP(W18,'11. Lists'!$F$47:$G$51,2,FALSE))","v":""},{"$nulls":3},"",{"$f":"IF(AB18=\"\",\"\",VLOOKUP(AB18,'11. Lists'!$F$36:$H$38,2,FALSE))","v":""},{"$f":"IF(AB18=\"\",\"\",VLOOKUP(AB18,'11. Lists'!$F$36:$H$38,3,FALSE))","v":""},"","","",{"$f":"IF(T18=\"\",\"\",VLOOKUP(T18,'11. Lists'!$B$47:$D$49,3,FALSE))","v":""},{"$f":"IF(D18=\"\",\"\",VLOOKUP(D18,'10. Condition and Temporal'!$B$6:$L$103,4,FALSE))","v":""},"1","1",{"$nulls":6},""]
[null,9,"Watercourses",{"$nulls":8},"","","",{"$nulls":5},{"$f":"IF(D19=\"\",\"\",VLOOKUP(D19,'9. All Habitats + Multipliers'!$C$4:$K$102,5,FALSE))","v":""},null,{"$f":"IF(T19=\"\",\"\",VLOOKUP(T19,'11. Lists'!$B$47:$D$49,2,FALSE))","v":""},{"$f":"IF(D19=\"\",\"\",VLOOKUP(D19,'10. Condition and Temporal'!$B$6:$C$103,2,FALSE))","v":""},{"$f":"IF(W19=\"\",\"\",VLOOKUP(W19,'11. Lists'!$F$47:$G$51,2,FALSE))","v":""},{"$nulls":3},"",{"$f":"IF(AB19=\"\",\"\",VLOOKUP(AB19,'11. Lists'!$F$36:$H$38,2,FALSE))","v":""},{"$f":"IF(AB19=\"\",\"\",VLOOKUP(AB19,'11. Lists'!$F$36:$H$38,3,FALSE))","v":""},"","","",{"$f":"IF(T19=\"\",\"\",VLOOKUP(T19,'11. Lists'!$B$47:$D$49,3,FALSE))","v":""},{"$f":"IF(D19=\"\",\"\",VLOOKUP(D19,'10. Condition and Temporal'!$B$6:$L$103,4,FALSE))","v":""},"1","1",{"$nulls":6},""]
[null,10,"Watercourses",{"$nulls":8},"","","",{"$nulls":5},{"$f":"IF(D20=\"\",\"\",VLOOKUP(D20,'9. All Habitats + Multipliers'!$C$4:$K$102,5,FALSE))","v":""},null,{"$f":"IF(T20=\"\",\"\",VLOOKUP(T20,'11. Lists'!$B$47:$D$49,2,FALSE))","v":""},{"$f":"IF(D20=\"\",\"\",VLOOKUP(D20,'10. Condition and Temporal'!$B$6:$C$103,2,FALSE))","v":""},{"$f":"IF(W20=\"\",\"\",VLOOKUP(W20,'11. Lists'!$F$47:$G$51,2,FALSE))","v":""},{"$nulls":3},"",{"$f":"IF(AB20=\"\",\"\",VLOOKUP(AB20,'11. Lists'!$F$36:$H$38,2,FALSE))","v":""},{"$f":"IF(AB20=\"\",\"\",VLOOKUP(AB20,'11. Lists'!$F$36:$H$38,3,FALSE))","v":""},"","","",{"$f":"IF(T20=\"\",\"\",VLOOKUP(T20,'11. Lists'!$B$47:$D$49,3,FALSE))","v":""},{"$f":"IF(D20=\"\",\"\",VLOOKUP(D20,'10. Condition and Temporal'!$B$6:$L$103,4,FALSE))","v":""},"1","1",{"$nulls":6},""]
[null,11,"Watercourses",{"$nulls":8},"","","",{"$nulls":5},{"$f":"IF(D21=\"\",\"\",VLOOKUP(D21,'9. All Habitats + Multipliers'!$C$4:$K$102,5,FALSE))","v":""},null,{"$f":"IF(T21=\"\",\"\",VLOOKUP(T21,'11. Lists'!$B$47:$D$49,2,FALSE))","v":""},{"$f":"IF(D21=\"\",\"\",VLOOKUP(D21,'10. Condition and Temporal'!$B$6:$C$103,2,FALSE))","v":""},{"$f":"IF(W21=\"\",\"\",VLOOKUP(W21,'11. Lists'!$F$47:$G$51,2,FALSE))","v":""},{"$nulls":3},"",{"$f":"IF(AB21=\"\",\"\",VLOOKUP(AB21,'11. Lists'!$F$36:$H$38,2,FALSE))","v":""},{"$f":"IF(AB21=\"\",\"\",VLOOKUP(AB21,'11. Lists'!$F$36:$H$38,3,FALSE))","v":""},"","","",{"$f":"IF(T21=\"\",\"\",VLOOKUP(T21,'11. Lists'!$B$47:$D$49,3,FALSE))","v":""},{"$f":"IF(D21=\"\",\"\",VLOOKUP(D21,'10. Condition and Temporal'!$B$6:$L$103,4,FALSE))","v":""},"1","1",{"$nulls":6},""]
[null,12,"Watercourses",{"$nulls":8},"","","",{"$nulls":5},{"$f":"IF(D22=\"\",\"\",VLOOKUP(D22,'9. All Habitats + Multipliers'!$C$4:$K$102,5,FALSE))","v":""},null,{"$f":"IF(T22=\"\",\"\",VLOOKUP(T22,'11. Lists'!$B$47:$D$49,2,FALSE))","v":""},{"$f":"IF(D22=\"\",\"\",VLOOKUP(D22,'10. Condition and Temporal'!$B$6:$C$103,2,FALSE))","v":""},{"$f":"IF(W22=\"\",\"\",VLOOKUP(W22,'11. Lists'!$F$47:$G$51,2,FALSE))","v":""},{"$nulls":3},"",{"$f":"IF(AB22=\"\",\"\",VLOOKUP(AB22,'11. Lists'!$F$36:$H$38,2,FALSE))","v":""},{"$f":"IF(AB22=\"\",\"\",VLOOKUP(AB22,'11. Lists'!$F$36:$H$38,3,FALSE))","v":""},"","","",{"$f":"IF(T22=\"\",\"\",VLOOKUP(T22,'11. Lists'!$B$47:$D$49,3,FALSE))","v":""},{"$f":"IF(D22=\"\",\"\",VLOOKUP(D22,'10. Condition and Temporal'!$B$6:$L$103,4,FALSE))","v":""},"1","1",{"$nulls":6},""]
[null,13,"Watercourses",{"$nulls":8},"","","",{"$nulls":5},{"$f":"IF(D23=\"\",\"\",VLOOKUP(D23,'9. All Habitats + Multipliers'!$C$4:$K$102,5,FALSE))","v":""},null,{"$f":"IF(T23=\"\",\"\",VLOOKUP(T23,'11. Lists'!$B$47:$D$49,2,FALSE))","v":""},{"$f":"IF(D23=\"\",\"\",VLOOKUP(D23,'10. Condition and Temporal'!$B$6:$C$103,2,FALSE))","v":""},{"$f":"IF(W23=\"\",\"\",VLOOKUP(W23,'11. Lists'!$F$47:$G$51,2,FALSE))","v":""},{"$nulls":3},"",{"$f":"IF(AB23=\"\",\"\",VLOOKUP(AB23,'11. Lists'!$F$36:$H$38,2,FALSE))","v":""},{"$f":"IF(AB23=\"\",\"\",VLOOKUP(AB23,'11. Lists'!$F$36:$H$38,3,FALSE))","v":""},"","","",{"$f":"IF(T23=\"\",\"\",VLOOKUP(T23,'11. Lists'!$B$47:$D$49,3,FALSE))","v":""},{"$f":"IF(D23=\"\",\"\",VLOOKUP(D23,'10. Condition and Temporal'!$B$6:$L$103,4,FALSE))","v":""},"1","1",{"$nulls":6},""]
[null,14,"Watercourses",{"$nulls":8},"","","",{"$nulls":5},{"$f":"IF(D24=\"\",\"\",VLOOKUP(D24,'9. All Habitats + Multipliers'!$C$4:$K$102,5,FALSE))","v":""},null,{"$f":"IF(T24=\"\",\"\",VLOOKUP(T24,'11. Lists'!$B$47:$D$49,2,FALSE))","v":""},{"$f":"IF(D24=\"\",\"\",VLOOKUP(D24,'10. Condition and Temporal'!$B$6:$C$103,2,FALSE))","v":""},{"$f":"IF(W24=\"\",\"\",VLOOKUP(W24,'11. Lists'!$F$47:$G$51,2,FALSE))","v":""},{"$nulls":3},"",{"$f":"IF(AB24=\"\",\"\",VLOOKUP(AB24,'11. Lists'!$F$36:$H$38,2,FALSE))","v":""},{"$f":"IF(AB24=\"\",\"\",VLOOKUP(AB24,'11. Lists'!$F$36:$H$38,3,FALSE))","v":""},"","","",{"$f":"IF(T24=\"\",\"\",VLOOKUP(T24,'11. Lists'!$B$47:$D$49,3,FALSE))","v":""},{"$f":"IF(D24=\"\",\"\",VLOOKUP(D24,'10. Condition and Temporal'!$B$6:$L$103,4,FALSE))","v":""},"1","1",{"$nulls":6},""]
[null,15,"Watercourses",{"$nulls":8},"","","",{"$nulls":5},{"$f":"IF(D25=\"\",\"\",VLOOKUP(D25,'9. All Habitats + Multipliers'!$C$4:$K$102,5,FALSE))","v":""},null,{"$f":"IF(T25=\"\",\"\",VLOOKUP(T25,'11. Lists'!$B$47:$D$49,2,FALSE))","v":""},{"$f":"IF(D25=\"\",\"\",VLOOKUP(D25,'10. Condition and Temporal'!$B$6:$C$103,2,FALSE))","v":""},{"$f":"IF(W25=\"\",\"\",VLOOKUP(W25,'11. Lists'!$F$47:$G$51,2,FALSE))","v":""},{"$nulls":3},"",{"$f":"IF(AB25=\"\",\"\",VLOOKUP(AB25,'11. Lists'!$F$36:$H$38,2,FALSE))","v":""},{"$f":"IF(AB25=\"\",\"\",VLOOKUP(AB25,'11. Lists'!$F$36:$H$38,3,FALSE))","v":""},"","","",{"$f":"IF(T25=\"\",\"\",VLOOKUP(T25,'11. Lists'!$B$47:$D$49,3,FALSE))","v":""},{"$f":"IF(D25=\"\",\"\",VLOOKUP(D25,'10. Condition and Temporal'!$B$6:$L$103,4,FALSE))","v":""},"1","1",{"$nulls":6},""]
[null,16,"Watercourses",{"$nulls":8},"","","",{"$nulls":5},{"$f":"IF(D26=\"\",\"\",VLOOKUP(D26,'9. All Habitats + Multipliers'!$C$4:$K$102,5,FALSE))","v":""},null,{"$f":"IF(T26=\"\",\"\",VLOOKUP(T26,'11. Lists'!$B$47:$D$49,2,FALSE))","v":""},{"$f":"IF(D26=\"\",\"\",VLOOKUP(D26,'10. Condition and Temporal'!$B$6:$C$103,2,FALSE))","v":""},{"$f":"IF(W26=\"\",\"\",VLOOKUP(W26,'11. Lists'!$F$47:$G$51,2,FALSE))","v":""},{"$nulls":3},"",{"$f":"IF(AB26=\"\",\"\",VLOOKUP(AB26,'11. Lists'!$F$36:$H$38,2,FALSE))","v":""},{"$f":"IF(AB26=\"\",\"\",VLOOKUP(AB26,'11. Lists'!$F$36:$H$38,3,FALSE))","v":""},"","","",{"$f":"IF(T26=\"\",\"\",VLOOKUP(T26,'11. Lists'!$B$47:$D$49,3,FALSE))","v":""},{"$f":"IF(D26=\"\",\"\",VLOOKUP(D26,'10. Condition and Temporal'!$B$6:$L$103,4,FALSE))","v":""},"1","1",{"$nulls":6},""]
[null,17,"Watercourses",{"$nulls":8},"","","",{"$nulls":5},{"$f":"IF(D27=\"\",\"\",VLOOKUP(D27,'9. All Habitats + Multipliers'!$C$4:$K$102,5,FALSE))","v":""},null,{"$f":"IF(T27=\"\",\"\",VLOOKUP(T27,'11. Lists'!$B$47:$D$49,2,FALSE))","v":""},{"$f":"IF(D27=\"\",\"\",VLOOKUP(D27,'10. Condition and Temporal'!$B$6:$C$103,2,FALSE))","v":""},{"$f":"IF(W27=\"\",\"\",VLOOKUP(W27,'11. Lists'!$F$47:$G$51,2,FALSE))","v":""},{"$nulls":3},"",{"$f":"IF(AB27=\"\",\"\",VLOOKUP(AB27,'11. Lists'!$F$36:$H$38,2,FALSE))","v":""},{"$f":"IF(AB27=\"\",\"\",VLOOKUP(AB27,'11. Lists'!$F$36:$H$38,3,FALSE))","v":""},"","","",{"$f":"IF(T27=\"\",\"\",VLOOKUP(T27,'11. Lists'!$B$47:$D$49,3,FALSE))","v":""},{"$f":"IF(D27=\"\",\"\",VLOOKUP(D27,'10. Condition and Temporal'!$B$6:$L$103,4,FALSE))","v":""},"1","1",{"$nulls":6},""]
[null,18,"Watercourses",{"$nulls":8},"","","",{"$nulls":5},{"$f":"IF(D28=\"\",\"\",VLOOKUP(D28,'9. All Habitats + Multipliers'!$C$4:$K$102,5,FALSE))","v":""},null,{"$f":"IF(T28=\"\",\"\",VLOOKUP(T28,'11. Lists'!$B$47:$D$49,2,FALSE))","v":""},{"$f":"IF(D28=\"\",\"\",VLOOKUP(D28,'10. Condition and Temporal'!$B$6:$C$103,2,FALSE))","v":""},{"$f":"IF(W28=\"\",\"\",VLOOKUP(W28,'11. Lists'!$F$47:$G$51,2,FALSE))","v":""},{"$nulls":3},"",{"$f":"IF(AB28=\"\",\"\",VLOOKUP(AB28,'11. Lists'!$F$36:$H$38,2,FALSE))","v":""},{"$f":"IF(AB28=\"\",\"\",VLOOKUP(AB28,'11. Lists'!$F$36:$H$38,3,FALSE))","v":""},"","","",{"$f":"IF(T28=\"\",\"\",VLOOKUP(T28,'11. Lists'!$B$47:$D$49,3,FALSE))","v":""},{"$f":"IF(D28=\"\",\"\",VLOOKUP(D28,'10. Condition and Temporal'!$B$6:$L$103,4,FALSE))","v":""},"1","1",{"$nulls":6},""]
[null,19,"Watercourses",{"$nulls":8},"","","",{"$nulls":5},{"$f":"IF(D29=\"\",\"\",VLOOKUP(D29,'9. All Habitats + Multipliers'!$C$4:$K$102,5,FALSE))","v":""},null,{"$f":"IF(T29=\"\",\"\",VLOOKUP(T29,'11. Lists'!$B$47:$D$49,2,FALSE))","v":""},{"$f":"IF(D29=\"\",\"\",VLOOKUP(D29,'10. Condition and Temporal'!$B$6:$C$103,2,FALSE))","v":""},{"$f":"IF(W29=\"\",\"\",VLOOKUP(W29,'11. Lists'!$F$47:$G$51,2,FALSE))","v":""},{"$nulls":3},"",{"$f":"IF(AB29=\"\",\"\",VLOOKUP(AB29,'11. Lists'!$F$36:$H$38,2,FALSE))","v":""},{"$f":"IF(AB29=\"\",\"\",VLOOKUP(AB29,'11. Lists'!$F$36:$H$38,3,FALSE))","v":""},"","","",{"$f":"IF(T29=\"\",\"\",VLOOKUP(T29,'11. Lists'!$B$47:$D$49,3,FALSE))","v":""},{"$f":"IF(D29=\"\",\"\",VLOOKUP(D29,'10. Condition and Temporal'!$B$6:$L$103,4,FALSE))","v":""},"1","1",{"$nulls":6},""]
[null,20,"Watercourses",{"$nulls":8},"",{"$f":"IF(I30=\"\",\"\",IF(J30+K30>I30,\"Length Error ▲\",I30-J30-K30))","v":""},"",{"$nulls":5},{"$f":"IF(D30=\"\",\"\",VLOOKUP(D30,'9. All Habitats + Multipliers'!$C$4:$K$102,5,FALSE))","v":""},null,{"$f":"IF(T30=\"\",\"\",VLOOKUP(T30,'11. Lists'!$B$47:$D$49,2,FALSE))","v":""},{"$f":"IF(D30=\"\",\"\",VLOOKUP(D30,'10. Condition and Temporal'!$B$6:$C$103,2,FALSE))","v":""},{"$f":"IF(W30=\"\",\"\",VLOOKUP(W30,'11. Lists'!$F$47:$G$51,2,FALSE))","v":""},{"$nulls":3},"",{"$f":"IF(AB30=\"\",\"\",VLOOKUP(AB30,'11. Lists'!$F$36:$H$38,2,FALSE))","v":""},{"$f":"IF(AB30=\"\",\"\",VLOOKUP(AB30,'11. Lists'!$F$36:$H$38,3,FALSE))","v":""},"","","",{"$f":"IF(T30=\"\",\"\",VLOOKUP(T30,'11. Lists'!$B$47:$D$49,3,FALSE))","v":""},{"$f":"IF(D30=\"\",\"\",VLOOKUP(D30,'10. Condition and Temporal'!$B$6:$L$103,4,FALSE))","v":""},"1","1",{"$nulls":6},""]
[{"$nulls":7},"Totals",{"$f":"SUM(I11:I30)","v":{"v":0,"d":"0.00"}},{"v":0,"d":"0.00"},{"v":0,"d":"0.00"},{"v":0,"d":"0.0000"},{"v":0,"d":"0.00"},{"v":0,"d":"0.0000"}]
[{"$nulls":7},"Error Check 1",{"$f":"IF(I31<J31+K31,\"Error - Lengths Retained and Enhanced Exceed Total Length ▲\",\"Lengths Acceptable ✓\")","v":"Lengths Acceptable ✓"},{"$nulls":5},{"$f":"IFERROR(FIND(\"Error\",#REF!),0)","v":0}]
[{"$nulls":7},"Error Check 1",{"$f":"IF(I31<5000,\"Lengths Acceptable ✓\",IF(I31>=5000,\"Length Exceeds Length Appropriate for Small Sites Metric ▲\"))","v":"Lengths Acceptable ✓"},{"$nulls":5},{"$f":"COUNTIF(L11:N30,\"*\"&\"error\"&\"*\")","v":0}]
[{"$nulls":17},"Data beyond this column is automated"]
[null,"1b. Habitats to be created"]
[]
[null,"Ref",null,null,"Condition Assessment",null,null,"D. Strategic significance","E. Total Length created (m)",null,null,"Units created onsite",null,null,"Comments",{"$nulls":4},"Habitat distinctiveness",null,null,"Habitat condition",{"$nulls":4},"Strategic significance",null,null,"Temporal multiplier",null,"Difficulty multipliers",null,"Watercourse and riparian encroachment"]
[null,null,"A. Broad Habitat","B. Habitat type","Acceptable condition options","C. Targeted condition",{"$nulls":8},"User comments","LPA comments",{"$nulls":3},"Distinctiveness",null,"Score","Condition ","Score",{"$nulls":3},"Strategic significance","Strategic significance","Strategic significance multiplier","Time to target condition/years","Time to target multiplier","Difficulty of creation category","Difficulty of creation multiplier"]
[null,1,"Watercourses",null,{"$f":"IF(D39=\"\",\"\",VLOOKUP(D39,'10. Condition and Temporal'!$B$6:$D$103,3,FALSE))","v":""},{"$nulls":6},{"$f":"IF(D39=\"\",\"\",IFERROR(IF(I39=\"\",\"\",((I39/1000)*(V39*X39))*(AH39*AF39)*AD39*AI39),\"This intervention is not permitted within the SSM ▲\"))","v":""},{"$nulls":7},{"$f":"IF(D39=\"\",\"\",VLOOKUP(D39,'9. All Habitats + Multipliers'!$C$4:$K$102,5,FALSE))","v":""},null,{"$f":"IF(T39=\"\",\"\",VLOOKUP(T39,'11. Lists'!$B$47:$D$49,2,FALSE))","v":""},{"$f":"IF(F39=\"\",\"\",F39)","v":""},{"$f":"IF(W39=\"\",\"\",VLOOKUP(W39,'11. Lists'!$F$47:$G$51,2,FALSE))","v":""},{"$nulls":3},{"$f":"IF(H39=\"\",\"\",H39)","v":""},{"$f":"IF(AB39=\"\",\"\",VLOOKUP(AB39,'11. Lists'!$F$36:$H$38,2,FALSE))","v":""},{"$f":"IF(AB39=\"\",\"\",VLOOKUP(AB39,'11. Lists'!$F$36:$H$38,3,FALSE))","v":""},{"$f":"IF(F39=\"\",\"\",IF(F39=\"Moderate\",VLOOKUP(D39,'10. Condition and Temporal'!$B$6:$L$103,6,FALSE),IF(F39=\"Good\",VLOOKUP(D39,'10. Condition and Temporal'!$B$6:$L$103,7,FALSE),IF(F39=\"Poor\",VLOOKUP(D39,'10. Condition and Temporal'!$B$6:$L$103,8,FALSE),IF(F39=\"Condition Assessment N/A\",VLOOKUP(D39,'10. Condition and Temporal'!$B$6:$L$103,9,FALSE),IF(F39=\"N/A - Other\",VLOOKUP(D39,'10. Condition and Temporal'!$B$6:$L$103,10,FALSE)))))))","v":""},{"$f":"IF(AE39=\"\",\"\",VLOOKUP(AE39,'11. Lists'!$I$47:$K$80,3,FALSE))","v":""},{"$f":"IF(D39=\"\",\"\",VLOOKUP(D39,'9. All Habitats + Multipliers'!$C$4:$K$102,7,FALSE))","v":""},{"$f":"IF(AG39=\"\",\"\",VLOOKUP(AG39,'11. Lists'!$J$35:$K$38,2,FALSE))","v":""},{"$f":"IF($D$39:$D$58=\"Culvert\",\"0.68\",\"1\")","v":"1"}]
[null,2,"Watercourses",null,{"$f":"IF(D40=\"\",\"\",VLOOKUP(D40,'10. Condition and Temporal'!$B$6:$D$103,3,FALSE))","v":""},{"$nulls":6},{"$f":"IF(D40=\"\",\"\",IFERROR(IF(I40=\"\",\"\",((I40/1000)*(V40*X40))*(AH40*AF40)*AD40*AI40),\"This intervention is not permitted within the SSM ▲\"))","v":""},{"$nulls":7},{"$f":"IF(D40=\"\",\"\",VLOOKUP(D40,'9. All Habitats + Multipliers'!$C$4:$K$102,5,FALSE))","v":""},null,{"$f":"IF(T40=\"\",\"\",VLOOKUP(T40,'11. Lists'!$B$47:$D$49,2,FALSE))","v":""},{"$f":"IF(F40=\"\",\"\",F40)","v":""},{"$f":"IF(W40=\"\",\"\",VLOOKUP(W40,'11. Lists'!$F$47:$G$51,2,FALSE))","v":""},{"$nulls":3},{"$f":"IF(H40=\"\",\"\",H40)","v":""},{"$f":"IF(AB40=\"\",\"\",VLOOKUP(AB40,'11. Lists'!$F$36:$H$38,2,FALSE))","v":""},{"$f":"IF(AB40=\"\",\"\",VLOOKUP(AB40,'11. Lists'!$F$36:$H$38,3,FALSE))","v":""},{"$f":"IF(F40=\"\",\"\",IF(F40=\"Moderate\",VLOOKUP(D40,'10. Condition and Temporal'!$B$6:$L$103,6,FALSE),IF(F40=\"Good\",VLOOKUP(D40,'10. Condition and Temporal'!$B$6:$L$103,7,FALSE),IF(F40=\"Poor\",VLOOKUP(D40,'10. Condition and Temporal'!$B$6:$L$103,8,FALSE),IF(F40=\"Condition Assessment N/A\",VLOOKUP(D40,'10. Condition and Temporal'!$B$6:$L$103,9,FALSE),IF(F40=\"N/A - Other\",VLOOKUP(D40,'10. Condition and Temporal'!$B$6:$L$103,10,FALSE)))))))","v":""},{"$f":"IF(AE40=\"\",\"\",VLOOKUP(AE40,'11. Lists'!$I$47:$K$80,3,FALSE))","v":""},{"$f":"IF(D40=\"\",\"\",VLOOKUP(D40,'9. All Habitats + Multipliers'!$C$4:$K$102,7,FALSE))","v":""},{"$f":"IF(AG40=\"\",\"\",VLOOKUP(AG40,'11. Lists'!$J$35:$K$38,2,FALSE))","v":""},"1"]
[null,3,"Watercourses",null,{"$f":"IF(D41=\"\",\"\",VLOOKUP(D41,'10. Condition and Temporal'!$B$6:$D$103,3,FALSE))","v":""},{"$nulls":6},"",{"$nulls":7},{"$f":"IF(D41=\"\",\"\",VLOOKUP(D41,'9. All Habitats + Multipliers'!$C$4:$K$102,5,FALSE))","v":""},null,{"$f":"IF(T41=\"\",\"\",VLOOKUP(T41,'11. Lists'!$B$47:$D$49,2,FALSE))","v":""},{"$f":"IF(F41=\"\",\"\",F41)","v":""},{"$f":"IF(W41=\"\",\"\",VLOOKUP(W41,'11. Lists'!$F$47:$G$51,2,FALSE))","v":""},{"$nulls":3},"",{"$f":"IF(AB41=\"\",\"\",VLOOKUP(AB41,'11. Lists'!$F$36:$H$38,2,FALSE))","v":""},{"$f":"IF(AB41=\"\",\"\",VLOOKUP(AB41,'11. Lists'!$F$36:$H$38,3,FALSE))","v":""},{"$f":"IF(F41=\"\",\"\",IF(F41=\"Moderate\",VLOOKUP(D41,'10. Condition and Temporal'!$B$6:$L$103,6,FALSE),IF(F41=\"Good\",VLOOKUP(D41,'10. Condition and Temporal'!$B$6:$L$103,7,FALSE),IF(F41=\"Poor\",VLOOKUP(D41,'10. Condition and Temporal'!$B$6:$L$103,8,FALSE),IF(F41=\"Condition Assessment N/A\",VLOOKUP(D41,'10. Condition and Temporal'!$B$6:$L$103,9,FALSE),IF(F41=\"N/A - Other\",VLOOKUP(D41,'10. Condition and Temporal'!$B$6:$L$103,10,FALSE)))))))","v":""},{"$f":"IF(AE41=\"\",\"\",VLOOKUP(AE41,'11. Lists'!$I$47:$K$80,3,FALSE))","v":""},{"$f":"IF(D41=\"\",\"\",VLOOKUP(D41,'9. All Habitats + Multipliers'!$C$4:$K$102,7,FALSE))","v":""},{"$f":"IF(AG41=\"\",\"\",VLOOKUP(AG41,'11. Lists'!$J$35:$K$38,2,FALSE))","v":""},"1"]
[null,4,"Watercourses",null,{"$f":"IF(D42=\"\",\"\",VLOOKUP(D42,'10. Condition and Temporal'!$B$6:$D$103,3,FALSE))","v":""},{"$nulls":6},"",{"$nulls":7},{"$f":"IF(D42=\"\",\"\",VLOOKUP(D42,'9. All Habitats + Multipliers'!$C$4:$K$102,5,FALSE))","v":""},null,{"$f":"IF(T42=\"\",\"\",VLOOKUP(T42,'11. Lists'!$B$47:$D$49,2,FALSE))","v":""},{"$f":"IF(F42=\"\",\"\",F42)","v":""},{"$f":"IF(W42=\"\",\"\",VLOOKUP(W42,'11. Lists'!$F$47:$G$51,2,FALSE))","v":""},{"$nulls":3},"",{"$f":"IF(AB42=\"\",\"\",VLOOKUP(AB42,'11. Lists'!$F$36:$H$38,2,FALSE))","v":""},{"$f":"IF(AB42=\"\",\"\",VLOOKUP(AB42,'11. Lists'!$F$36:$H$38,3,FALSE))","v":""},{"$f":"IF(F42=\"\",\"\",IF(F42=\"Moderate\",VLOOKUP(D42,'10. Condition and Temporal'!$B$6:$L$103,6,FALSE),IF(F42=\"Good\",VLOOKUP(D42,'10. Condition and Temporal'!$B$6:$L$103,7,FALSE),IF(F42=\"Poor\",VLOOKUP(D42,'10. Condition and Temporal'!$B$6:$L$103,8,FALSE),IF(F42=\"Condition Assessment N/A\",VLOOKUP(D42,'10. Condition and Temporal'!$B$6:$L$103,9,FALSE),IF(F42=\"N/A - Other\",VLOOKUP(D42,'10. Condition and Temporal'!$B$6:$L$103,10,FALSE)))))))","v":""},{"$f":"IF(AE42=\"\",\"\",VLOOKUP(AE42,'11. Lists'!$I$47:$K$80,3,FALSE))","v":""},{"$f":"IF(D42=\"\",\"\",VLOOKUP(D42,'9. All Habitats + Multipliers'!$C$4:$K$102,7,FALSE))","v":""},{"$f":"IF(AG42=\"\",\"\",VLOOKUP(AG42,'11. Lists'!$J$35:$K$38,2,FALSE))","v":""},"1"]
[null,5,"Watercourses",null,{"$f":"IF(D43=\"\",\"\",VLOOKUP(D43,'10. Condition and Temporal'!$B$6:$D$103,3,FALSE))","v":""},{"$nulls":6},"",{"$nulls":7},{"$f":"IF(D43=\"\",\"\",VLOOKUP(D43,'9. All Habitats + Multipliers'!$C$4:$K$102,5,FALSE))","v":""},null,{"$f":"IF(T43=\"\",\"\",VLOOKUP(T43,'11. Lists'!$B$47:$D$49,2,FALSE))","v":""},{"$f":"IF(F43=\"\",\"\",F43)","v":""},{"$f":"IF(W43=\"\",\"\",VLOOKUP(W43,'11. Lists'!$F$47:$G$51,2,FALSE))","v":""},{"$nulls":3},"",{"$f":"IF(AB43=\"\",\"\",VLOOKUP(AB43,'11. Lists'!$F$36:$H$38,2,FALSE))","v":""},{"$f":"IF(AB43=\"\",\"\",VLOOKUP(AB43,'11. Lists'!$F$36:$H$38,3,FALSE))","v":""},{"$f":"IF(F43=\"\",\"\",IF(F43=\"Moderate\",VLOOKUP(D43,'10. Condition and Temporal'!$B$6:$L$103,6,FALSE),IF(F43=\"Good\",VLOOKUP(D43,'10. Condition and Temporal'!$B$6:$L$103,7,FALSE),IF(F43=\"Poor\",VLOOKUP(D43,'10. Condition and Temporal'!$B$6:$L$103,8,FALSE),IF(F43=\"Condition Assessment N/A\",VLOOKUP(D43,'10. Condition and Temporal'!$B$6:$L$103,9,FALSE),IF(F43=\"N/A - Other\",VLOOKUP(D43,'10. Condition and Temporal'!$B$6:$L$103,10,FALSE)))))))","v":""},{"$f":"IF(AE43=\"\",\"\",VLOOKUP(AE43,'11. Lists'!$I$47:$K$80,3,FALSE))","v":""},{"$f":"IF(D43=\"\",\"\",VLOOKUP(D43,'9. All Habitats + Multipliers'!$C$4:$K$102,7,FALSE))","v":""},{"$f":"IF(AG43=\"\",\"\",VLOOKUP(AG43,'11. Lists'!$J$35:$K$38,2,FALSE))","v":""},"1"]
[null,6,"Watercourses",null,{"$f":"IF(D44=\"\",\"\",VLOOKUP(D44,'10. Condition and Temporal'!$B$6:$D$103,3,FALSE))","v":""},{"$nulls":6},"",{"$nulls":7},{"$f":"IF(D44=\"\",\"\",VLOOKUP(D44,'9. All Habitats + Multipliers'!$C$4:$K$102,5,FALSE))","v":""},null,{"$f":"IF(T44=\"\",\"\",VLOOKUP(T44,'11. Lists'!$B$47:$D$49,2,FALSE))","v":""},"",{"$f":"IF(W44=\"\",\"\",VLOOKUP(W44,'11. Lists'!$F$47:$G$51,2,FALSE))","v":""},{"$nulls":3},"",{"$f":"IF(AB44=\"\",\"\",VLOOKUP(AB44,'11. Lists'!$F$36:$H$38,2,FALSE))","v":""},{"$f":"IF(AB44=\"\",\"\",VLOOKUP(AB44,'11. Lists'!$F$36:$H$38,3,FALSE))","v":""},{"$f":"IF(F44=\"\",\"\",IF(F44=\"Moderate\",VLOOKUP(D44,'10. Condition and Temporal'!$B$6:$L$103,6,FALSE),IF(F44=\"Good\",VLOOKUP(D44,'10. Condition and Temporal'!$B$6:$L$103,7,FALSE),IF(F44=\"Poor\",VLOOKUP(D44,'10. Condition and Temporal'!$B$6:$L$103,8,FALSE),IF(F44=\"Condition Assessment N/A\",VLOOKUP(D44,'10. Condition and Temporal'!$B$6:$L$103,9,FALSE),IF(F44=\"N/A - Other\",VLOOKUP(D44,'10. Condition and Temporal'!$B$6:$L$103,10,FALSE)))))))","v":""},{"$f":"IF(AE44=\"\",\"\",VLOOKUP(AE44,'11. Lists'!$I$47:$K$80,3,FALSE))","v":""},{"$f":"IF(D44=\"\",\"\",VLOOKUP(D44,'9. All Habitats + Multipliers'!$C$4:$K$102,7,FALSE))","v":""},{"$f":"IF(AG44=\"\",\"\",VLOOKUP(AG44,'11. Lists'!$J$35:$K$38,2,FALSE))","v":""},"1"]
[null,7,"Watercourses",null,{"$f":"IF(D45=\"\",\"\",VLOOKUP(D45,'10. Condition and Temporal'!$B$6:$D$103,3,FALSE))","v":""},{"$nulls":6},"",{"$nulls":7},{"$f":"IF(D45=\"\",\"\",VLOOKUP(D45,'9. All Habitats + Multipliers'!$C$4:$K$102,5,FALSE))","v":""},null,{"$f":"IF(T45=\"\",\"\",VLOOKUP(T45,'11. Lists'!$B$47:$D$49,2,FALSE))","v":""},"",{"$f":"IF(W45=\"\",\"\",VLOOKUP(W45,'11. Lists'!$F$47:$G$51,2,FALSE))","v":""},{"$nulls":3},"",{"$f":"IF(AB45=\"\",\"\",VLOOKUP(AB45,'11. Lists'!$F$36:$H$38,2,FALSE))","v":""},{"$f":"IF(AB45=\"\",\"\",VLOOKUP(AB45,'11. Lists'!$F$36:$H$38,3,FALSE))","v":""},{"$f":"IF(F45=\"\",\"\",IF(F45=\"Moderate\",VLOOKUP(D45,'10. Condition and Temporal'!$B$6:$L$103,6,FALSE),IF(F45=\"Good\",VLOOKUP(D45,'10. Condition and Temporal'!$B$6:$L$103,7,FALSE),IF(F45=\"Poor\",VLOOKUP(D45,'10. Condition and Temporal'!$B$6:$L$103,8,FALSE),IF(F45=\"Condition Assessment N/A\",VLOOKUP(D45,'10. Condition and Temporal'!$B$6:$L$103,9,FALSE),IF(F45=\"N/A - Other\",VLOOKUP(D45,'10. Condition and Temporal'!$B$6:$L$103,10,FALSE)))))))","v":""},{"$f":"IF(AE45=\"\",\"\",VLOOKUP(AE45,'11. Lists'!$I$47:$K$80,3,FALSE))","v":""},{"$f":"IF(D45=\"\",\"\",VLOOKUP(D45,'9. All Habitats + Multipliers'!$C$4:$K$102,7,FALSE))","v":""},{"$f":"IF(AG45=\"\",\"\",VLOOKUP(AG45,'11. Lists'!$J$35:$K$38,2,FALSE))","v":""},"1"]
[null,8,"Watercourses",null,{"$f":"IF(D46=\"\",\"\",VLOOKUP(D46,'10. Condition and Temporal'!$B$6:$D$103,3,FALSE))","v":""},{"$nulls":6},"",{"$nulls":7},{"$f":"IF(D46=\"\",\"\",VLOOKUP(D46,'9. All Habitats + Multipliers'!$C$4:$K$102,5,FALSE))","v":""},null,{"$f":"IF(T46=\"\",\"\",VLOOKUP(T46,'11. Lists'!$B$47:$D$49,2,FALSE))","v":""},"",{"$f":"IF(W46=\"\",\"\",VLOOKUP(W46,'11. Lists'!$F$47:$G$51,2,FALSE))","v":""},{"$nulls":3},"",{"$f":"IF(AB46=\"\",\"\",VLOOKUP(AB46,'11. Lists'!$F$36:$H$38,2,FALSE))","v":""},{"$f":"IF(AB46=\"\",\"\",VLOOKUP(AB46,'11. Lists'!$F$36:$H$38,3,FALSE))","v":""},{"$f":"IF(F46=\"\",\"\",IF(F46=\"Moderate\",VLOOKUP(D46,'10. Condition and Temporal'!$B$6:$L$103,6,FALSE),IF(F46=\"Good\",VLOOKUP(D46,'10. Condition and Temporal'!$B$6:$L$103,7,FALSE),IF(F46=\"Poor\",VLOOKUP(D46,'10. Condition and Temporal'!$B$6:$L$103,8,FALSE),IF(F46=\"Condition Assessment N/A\",VLOOKUP(D46,'10. Condition and Temporal'!$B$6:$L$103,9,FALSE),IF(F46=\"N/A - Other\",VLOOKUP(D46,'10. Condition and Temporal'!$B$6:$L$103,10,FALSE)))))))","v":""},{"$f":"IF(AE46=\"\",\"\",VLOOKUP(AE46,'11. Lists'!$I$47:$K$80,3,FALSE))","v":""},{"$f":"IF(D46=\"\",\"\",VLOOKUP(D46,'9. All Habitats + Multipliers'!$C$4:$K$102,7,FALSE))","v":""},{"$f":"IF(AG46=\"\",\"\",VLOOKUP(AG46,'11. Lists'!$J$35:$K$38,2,FALSE))","v":""},"1"]
[null,9,"Watercourses",null,{"$f":"IF(D47=\"\",\"\",VLOOKUP(D47,'10. Condition and Temporal'!$B$6:$D$103,3,FALSE))","v":""},{"$nulls":6},"",{"$nulls":7},{"$f":"IF(D47=\"\",\"\",VLOOKUP(D47,'9. All Habitats + Multipliers'!$C$4:$K$102,5,FALSE))","v":""},null,{"$f":"IF(T47=\"\",\"\",VLOOKUP(T47,'11. Lists'!$B$47:$D$49,2,FALSE))","v":""},"",{"$f":"IF(W47=\"\",\"\",VLOOKUP(W47,'11. Lists'!$F$47:$G$51,2,FALSE))","v":""},{"$nulls":3},"",{"$f":"IF(AB47=\"\",\"\",VLOOKUP(AB47,'11. Lists'!$F$36:$H$38,2,FALSE))","v":""},{"$f":"IF(AB47=\"\",\"\",VLOOKUP(AB47,'11. Lists'!$F$36:$H$38,3,FALSE))","v":""},{"$f":"IF(F47=\"\",\"\",IF(F47=\"Moderate\",VLOOKUP(D47,'10. Condition and Temporal'!$B$6:$L$103,6,FALSE),IF(F47=\"Good\",VLOOKUP(D47,'10. Condition and Temporal'!$B$6:$L$103,7,FALSE),IF(F47=\"Poor\",VLOOKUP(D47,'10. Condition and Temporal'!$B$6:$L$103,8,FALSE),IF(F47=\"Condition Assessment N/A\",VLOOKUP(D47,'10. Condition and Temporal'!$B$6:$L$103,9,FALSE),IF(F47=\"N/A - Other\",VLOOKUP(D47,'10. Condition and Temporal'!$B$6:$L$103,10,FALSE)))))))","v":""},{"$f":"IF(AE47=\"\",\"\",VLOOKUP(AE47,'11. Lists'!$I$47:$K$80,3,FALSE))","v":""},{"$f":"IF(D47=\"\",\"\",VLOOKUP(D47,'9. All Habitats + Multipliers'!$C$4:$K$102,7,FALSE))","v":""},{"$f":"IF(AG47=\"\",\"\",VLOOKUP(AG47,'11. Lists'!$J$35:$K$38,2,FALSE))","v":""},"1"]
[null,10,"Watercourses",null,{"$f":"IF(D48=\"\",\"\",VLOOKUP(D48,'10. Condition and Temporal'!$B$6:$D$103,3,FALSE))","v":""},{"$nulls":6},"",{"$nulls":7},{"$f":"IF(D48=\"\",\"\",VLOOKUP(D48,'9. All Habitats + Multipliers'!$C$4:$K$102,5,FALSE))","v":""},null,{"$f":"IF(T48=\"\",\"\",VLOOKUP(T48,'11. Lists'!$B$47:$D$49,2,FALSE))","v":""},"",{"$f":"IF(W48=\"\",\"\",VLOOKUP(W48,'11. Lists'!$F$47:$G$51,2,FALSE))","v":""},{"$nulls":3},"",{"$f":"IF(AB48=\"\",\"\",VLOOKUP(AB48,'11. Lists'!$F$36:$H$38,2,FALSE))","v":""},{"$f":"IF(AB48=\"\",\"\",VLOOKUP(AB48,'11. Lists'!$F$36:$H$38,3,FALSE))","v":""},{"$f":"IF(F48=\"\",\"\",IF(F48=\"Moderate\",VLOOKUP(D48,'10. Condition and Temporal'!$B$6:$L$103,6,FALSE),IF(F48=\"Good\",VLOOKUP(D48,'10. Condition and Temporal'!$B$6:$L$103,7,FALSE),IF(F48=\"Poor\",VLOOKUP(D48,'10. Condition and Temporal'!$B$6:$L$103,8,FALSE),IF(F48=\"Condition Assessment N/A\",VLOOKUP(D48,'10. Condition and Temporal'!$B$6:$L$103,9,FALSE),IF(F48=\"N/A - Other\",VLOOKUP(D48,'10. Condition and Temporal'!$B$6:$L$103,10,FALSE)))))))","v":""},{"$f":"IF(AE48=\"\",\"\",VLOOKUP(AE48,'11. Lists'!$I$47:$K$80,3,FALSE))","v":""},{"$f":"IF(D48=\"\",\"\",VLOOKUP(D48,'9. All Habitats + Multipliers'!$C$4:$K$102,7,FALSE))","v":""},{"$f":"IF(AG48=\"\",\"\",VLOOKUP(AG48,'11. Lists'!$J$35:$K$38,2,FALSE))","v":""},"1"]
[null,11,"Watercourses",null,{"$f":"IF(D49=\"\",\"\",VLOOKUP(D49,'10. Condition and Temporal'!$B$6:$D$103,3,FALSE))","v":""},{"$nulls":6},"",{"$nulls":7},{"$f":"IF(D49=\"\",\"\",VLOOKUP(D49,'9. All Habitats + Multipliers'!$C$4:$K$102,5,FALSE))","v":""},null,{"$f":"IF(T49=\"\",\"\",VLOOKUP(T49,'11. Lists'!$B$47:$D$49,2,FALSE))","v":""},"",{"$f":"IF(W49=\"\",\"\",VLOOKUP(W49,'11. Lists'!$F$47:$G$51,2,FALSE))","v":""},{"$nulls":3},"",{"$f":"IF(AB49=\"\",\"\",VLOOKUP(AB49,'11. Lists'!$F$36:$H$38,2,FALSE))","v":""},{"$f":"IF(AB49=\"\",\"\",VLOOKUP(AB49,'11. Lists'!$F$36:$H$38,3,FALSE))","v":""},{"$f":"IF(F49=\"\",\"\",IF(F49=\"Moderate\",VLOOKUP(D49,'10. Condition and Temporal'!$B$6:$L$103,6,FALSE),IF(F49=\"Good\",VLOOKUP(D49,'10. Condition and Temporal'!$B$6:$L$103,7,FALSE),IF(F49=\"Poor\",VLOOKUP(D49,'10. Condition and Temporal'!$B$6:$L$103,8,FALSE),IF(F49=\"Condition Assessment N/A\",VLOOKUP(D49,'10. Condition and Temporal'!$B$6:$L$103,9,FALSE),IF(F49=\"N/A - Other\",VLOOKUP(D49,'10. Condition and Temporal'!$B$6:$L$103,10,FALSE)))))))","v":""},{"$f":"IF(AE49=\"\",\"\",VLOOKUP(AE49,'11. Lists'!$I$47:$K$80,3,FALSE))","v":""},{"$f":"IF(D49=\"\",\"\",VLOOKUP(D49,'9. All Habitats + Multipliers'!$C$4:$K$102,7,FALSE))","v":""},{"$f":"IF(AG49=\"\",\"\",VLOOKUP(AG49,'11. Lists'!$J$35:$K$38,2,FALSE))","v":""},"1"]
[null,12,"Watercourses",null,{"$f":"IF(D50=\"\",\"\",VLOOKUP(D50,'10. Condition and Temporal'!$B$6:$D$103,3,FALSE))","v":""},{"$nulls":6},"",{"$nulls":7},{"$f":"IF(D50=\"\",\"\",VLOOKUP(D50,'9. All Habitats + Multipliers'!$C$4:$K$102,5,FALSE))","v":""},null,{"$f":"IF(T50=\"\",\"\",VLOOKUP(T50,'11. Lists'!$B$47:$D$49,2,FALSE))","v":""},"",{"$f":"IF(W50=\"\",\"\",VLOOKUP(W50,'11. Lists'!$F$47:$G$51,2,FALSE))","v":""},{"$nulls":3},"",{"$f":"IF(AB50=\"\",\"\",VLOOKUP(AB50,'11. Lists'!$F$36:$H$38,2,FALSE))","v":""},{"$f":"IF(AB50=\"\",\"\",VLOOKUP(AB50,'11. Lists'!$F$36:$H$38,3,FALSE))","v":""},{"$f":"IF(F50=\"\",\"\",IF(F50=\"Moderate\",VLOOKUP(D50,'10. Condition and Temporal'!$B$6:$L$103,6,FALSE),IF(F50=\"Good\",VLOOKUP(D50,'10. Condition and Temporal'!$B$6:$L$103,7,FALSE),IF(F50=\"Poor\",VLOOKUP(D50,'10. Condition and Temporal'!$B$6:$L$103,8,FALSE),IF(F50=\"Condition Assessment N/A\",VLOOKUP(D50,'10. Condition and Temporal'!$B$6:$L$103,9,FALSE),IF(F50=\"N/A - Other\",VLOOKUP(D50,'10. Condition and Temporal'!$B$6:$L$103,10,FALSE)))))))","v":""},{"$f":"IF(AE50=\"\",\"\",VLOOKUP(AE50,'11. Lists'!$I$47:$K$80,3,FALSE))","v":""},{"$f":"IF(D50=\"\",\"\",VLOOKUP(D50,'9. All Habitats + Multipliers'!$C$4:$K$102,7,FALSE))","v":""},{"$f":"IF(AG50=\"\",\"\",VLOOKUP(AG50,'11. Lists'!$J$35:$K$38,2,FALSE))","v":""},"1"]
[null,13,"Watercourses",null,{"$f":"IF(D51=\"\",\"\",VLOOKUP(D51,'10. Condition and Temporal'!$B$6:$D$103,3,FALSE))","v":""},{"$nulls":6},"",{"$nulls":7},{"$f":"IF(D51=\"\",\"\",VLOOKUP(D51,'9. All Habitats + Multipliers'!$C$4:$K$102,5,FALSE))","v":""},null,{"$f":"IF(T51=\"\",\"\",VLOOKUP(T51,'11. Lists'!$B$47:$D$49,2,FALSE))","v":""},"",{"$f":"IF(W51=\"\",\"\",VLOOKUP(W51,'11. Lists'!$F$47:$G$51,2,FALSE))","v":""},{"$nulls":3},"",{"$f":"IF(AB51=\"\",\"\",VLOOKUP(AB51,'11. Lists'!$F$36:$H$38,2,FALSE))","v":""},{"$f":"IF(AB51=\"\",\"\",VLOOKUP(AB51,'11. Lists'!$F$36:$H$38,3,FALSE))","v":""},{"$f":"IF(F51=\"\",\"\",IF(F51=\"Moderate\",VLOOKUP(D51,'10. Condition and Temporal'!$B$6:$L$103,6,FALSE),IF(F51=\"Good\",VLOOKUP(D51,'10. Condition and Temporal'!$B$6:$L$103,7,FALSE),IF(F51=\"Poor\",VLOOKUP(D51,'10. Condition and Temporal'!$B$6:$L$103,8,FALSE),IF(F51=\"Condition Assessment N/A\",VLOOKUP(D51,'10. Condition and Temporal'!$B$6:$L$103,9,FALSE),IF(F51=\"N/A - Other\",VLOOKUP(D51,'10. Condition and Temporal'!$B$6:$L$103,10,FALSE)))))))","v":""},{"$f":"IF(AE51=\"\",\"\",VLOOKUP(AE51,'11. Lists'!$I$47:$K$80,3,FALSE))","v":""},{"$f":"IF(D51=\"\",\"\",VLOOKUP(D51,'9. All Habitats + Multipliers'!$C$4:$K$102,7,FALSE))","v":""},{"$f":"IF(AG51=\"\",\"\",VLOOKUP(AG51,'11. Lists'!$J$35:$K$38,2,FALSE))","v":""},"1"]
[null,14,"Watercourses",null,{"$f":"IF(D52=\"\",\"\",VLOOKUP(D52,'10. Condition and Temporal'!$B$6:$D$103,3,FALSE))","v":""},{"$nulls":6},"",{"$nulls":7},{"$f":"IF(D52=\"\",\"\",VLOOKUP(D52,'9. All Habitats + Multipliers'!$C$4:$K$102,5,FALSE))","v":""},null,{"$f":"IF(T52=\"\",\"\",VLOOKUP(T52,'11. Lists'!$B$47:$D$49,2,FALSE))","v":""},"",{"$f":"IF(W52=\"\",\"\",VLOOKUP(W52,'11. Lists'!$F$47:$G$51,2,FALSE))","v":""},{"$nulls":3},"",{"$f":"IF(AB52=\"\",\"\",VLOOKUP(AB52,'11. Lists'!$F$36:$H$38,2,FALSE))","v":""},{"$f":"IF(AB52=\"\",\"\",VLOOKUP(AB52,'11. Lists'!$F$36:$H$38,3,FALSE))","v":""},{"$f":"IF(F52=\"\",\"\",IF(F52=\"Moderate\",VLOOKUP(D52,'10. Condition and Temporal'!$B$6:$L$103,6,FALSE),IF(F52=\"Good\",VLOOKUP(D52,'10. Condition and Temporal'!$B$6:$L$103,7,FALSE),IF(F52=\"Poor\",VLOOKUP(D52,'10. Condition and Temporal'!$B$6:$L$103,8,FALSE),IF(F52=\"Condition Assessment N/A\",VLOOKUP(D52,'10. Condition and Temporal'!$B$6:$L$103,9,FALSE),IF(F52=\"N/A - Other\",VLOOKUP(D52,'10. Condition and Temporal'!$B$6:$L$103,10,FALSE)))))))","v":""},{"$f":"IF(AE52=\"\",\"\",VLOOKUP(AE52,'11. Lists'!$I$47:$K$80,3,FALSE))","v":""},{"$f":"IF(D52=\"\",\"\",VLOOKUP(D52,'9. All Habitats + Multipliers'!$C$4:$K$102,7,FALSE))","v":""},{"$f":"IF(AG52=\"\",\"\",VLOOKUP(AG52,'11. Lists'!$J$35:$K$38,2,FALSE))","v":""},"1"]
[null,15,"Watercourses",null,{"$f":"IF(D53=\"\",\"\",VLOOKUP(D53,'10. Condition and Temporal'!$B$6:$D$103,3,FALSE))","v":""},{"$nulls":6},"",{"$nulls":7},{"$f":"IF(D53=\"\",\"\",VLOOKUP(D53,'9. All Habitats + Multipliers'!$C$4:$K$102,5,FALSE))","v":""},null,{"$f":"IF(T53=\"\",\"\",VLOOKUP(T53,'11. Lists'!$B$47:$D$49,2,FALSE))","v":""},"",{"$f":"IF(W53=\"\",\"\",VLOOKUP(W53,'11. Lists'!$F$47:$G$51,2,FALSE))","v":""},{"$nulls":3},"",{"$f":"IF(AB53=\"\",\"\",VLOOKUP(AB53,'11. Lists'!$F$36:$H$38,2,FALSE))","v":""},{"$f":"IF(AB53=\"\",\"\",VLOOKUP(AB53,'11. Lists'!$F$36:$H$38,3,FALSE))","v":""},{"$f":"IF(F53=\"\",\"\",IF(F53=\"Moderate\",VLOOKUP(D53,'10. Condition and Temporal'!$B$6:$L$103,6,FALSE),IF(F53=\"Good\",VLOOKUP(D53,'10. Condition and Temporal'!$B$6:$L$103,7,FALSE),IF(F53=\"Poor\",VLOOKUP(D53,'10. Condition and Temporal'!$B$6:$L$103,8,FALSE),IF(F53=\"Condition Assessment N/A\",VLOOKUP(D53,'10. Condition and Temporal'!$B$6:$L$103,9,FALSE),IF(F53=\"N/A - Other\",VLOOKUP(D53,'10. Condition and Temporal'!$B$6:$L$103,10,FALSE)))))))","v":""},{"$f":"IF(AE53=\"\",\"\",VLOOKUP(AE53,'11. Lists'!$I$47:$K$80,3,FALSE))","v":""},{"$f":"IF(D53=\"\",\"\",VLOOKUP(D53,'9. All Habitats + Multipliers'!$C$4:$K$102,7,FALSE))","v":""},{"$f":"IF(AG53=\"\",\"\",VLOOKUP(AG53,'11. Lists'!$J$35:$K$38,2,FALSE))","v":""},"1"]
[null,16,"Watercourses",null,{"$f":"IF(D54=\"\",\"\",VLOOKUP(D54,'10. Condition and Temporal'!$B$6:$D$103,3,FALSE))","v":""},{"$nulls":6},"",{"$nulls":7},{"$f":"IF(D54=\"\",\"\",VLOOKUP(D54,'9. All Habitats + Multipliers'!$C$4:$K$102,5,FALSE))","v":""},null,{"$f":"IF(T54=\"\",\"\",VLOOKUP(T54,'11. Lists'!$B$47:$D$49,2,FALSE))","v":""},"",{"$f":"IF(W54=\"\",\"\",VLOOKUP(W54,'11. Lists'!$F$47:$G$51,2,FALSE))","v":""},{"$nulls":3},"",{"$f":"IF(AB54=\"\",\"\",VLOOKUP(AB54,'11. Lists'!$F$36:$H$38,2,FALSE))","v":""},{"$f":"IF(AB54=\"\",\"\",VLOOKUP(AB54,'11. Lists'!$F$36:$H$38,3,FALSE))","v":""},{"$f":"IF(F54=\"\",\"\",IF(F54=\"Moderate\",VLOOKUP(D54,'10. Condition and Temporal'!$B$6:$L$103,6,FALSE),IF(F54=\"Good\",VLOOKUP(D54,'10. Condition and Temporal'!$B$6:$L$103,7,FALSE),IF(F54=\"Poor\",VLOOKUP(D54,'10. Condition and Temporal'!$B$6:$L$103,8,FALSE),IF(F54=\"Condition Assessment N/A\",VLOOKUP(D54,'10. Condition and Temporal'!$B$6:$L$103,9,FALSE),IF(F54=\"N/A - Other\",VLOOKUP(D54,'10. Condition and Temporal'!$B$6:$L$103,10,FALSE)))))))","v":""},{"$f":"IF(AE54=\"\",\"\",VLOOKUP(AE54,'11. Lists'!$I$47:$K$80,3,FALSE))","v":""},{"$f":"IF(D54=\"\",\"\",VLOOKUP(D54,'9. All Habitats + Multipliers'!$C$4:$K$102,7,FALSE))","v":""},{"$f":"IF(AG54=\"\",\"\",VLOOKUP(AG54,'11. Lists'!$J$35:$K$38,2,FALSE))","v":""},"1"]
[null,17,"Watercourses",null,{"$f":"IF(D55=\"\",\"\",VLOOKUP(D55,'10. Condition and Temporal'!$B$6:$D$103,3,FALSE))","v":""},{"$nulls":6},"",{"$nulls":7},{"$f":"IF(D55=\"\",\"\",VLOOKUP(D55,'9. All Habitats + Multipliers'!$C$4:$K$102,5,FALSE))","v":""},null,{"$f":"IF(T55=\"\",\"\",VLOOKUP(T55,'11. Lists'!$B$47:$D$49,2,FALSE))","v":""},"",{"$f":"IF(W55=\"\",\"\",VLOOKUP(W55,'11. Lists'!$F$47:$G$51,2,FALSE))","v":""},{"$nulls":3},"",{"$f":"IF(AB55=\"\",\"\",VLOOKUP(AB55,'11. Lists'!$F$36:$H$38,2,FALSE))","v":""},{"$f":"IF(AB55=\"\",\"\",VLOOKUP(AB55,'11. Lists'!$F$36:$H$38,3,FALSE))","v":""},{"$f":"IF(F55=\"\",\"\",IF(F55=\"Moderate\",VLOOKUP(D55,'10. Condition and Temporal'!$B$6:$L$103,6,FALSE),IF(F55=\"Good\",VLOOKUP(D55,'10. Condition and Temporal'!$B$6:$L$103,7,FALSE),IF(F55=\"Poor\",VLOOKUP(D55,'10. Condition and Temporal'!$B$6:$L$103,8,FALSE),IF(F55=\"Condition Assessment N/A\",VLOOKUP(D55,'10. Condition and Temporal'!$B$6:$L$103,9,FALSE),IF(F55=\"N/A - Other\",VLOOKUP(D55,'10. Condition and Temporal'!$B$6:$L$103,10,FALSE)))))))","v":""},{"$f":"IF(AE55=\"\",\"\",VLOOKUP(AE55,'11. Lists'!$I$47:$K$80,3,FALSE))","v":""},{"$f":"IF(D55=\"\",\"\",VLOOKUP(D55,'9. All Habitats + Multipliers'!$C$4:$K$102,7,FALSE))","v":""},{"$f":"IF(AG55=\"\",\"\",VLOOKUP(AG55,'11. Lists'!$J$35:$K$38,2,FALSE))","v":""},"1"]
[null,18,"Watercourses",null,{"$f":"IF(D56=\"\",\"\",VLOOKUP(D56,'10. Condition and Temporal'!$B$6:$D$103,3,FALSE))","v":""},{"$nulls":6},"",{"$nulls":7},{"$f":"IF(D56=\"\",\"\",VLOOKUP(D56,'9. All Habitats + Multipliers'!$C$4:$K$102,5,FALSE))","v":""},null,{"$f":"IF(T56=\"\",\"\",VLOOKUP(T56,'11. Lists'!$B$47:$D$49,2,FALSE))","v":""},"",{"$f":"IF(W56=\"\",\"\",VLOOKUP(W56,'11. Lists'!$F$47:$G$51,2,FALSE))","v":""},{"$nulls":3},"",{"$f":"IF(AB56=\"\",\"\",VLOOKUP(AB56,'11. Lists'!$F$36:$H$38,2,FALSE))","v":""},{"$f":"IF(AB56=\"\",\"\",VLOOKUP(AB56,'11. Lists'!$F$36:$H$38,3,FALSE))","v":""},{"$f":"IF(F56=\"\",\"\",IF(F56=\"Moderate\",VLOOKUP(D56,'10. Condition and Temporal'!$B$6:$L$103,6,FALSE),IF(F56=\"Good\",VLOOKUP(D56,'10. Condition and Temporal'!$B$6:$L$103,7,FALSE),IF(F56=\"Poor\",VLOOKUP(D56,'10. Condition and Temporal'!$B$6:$L$103,8,FALSE),IF(F56=\"Condition Assessment N/A\",VLOOKUP(D56,'10. Condition and Temporal'!$B$6:$L$103,9,FALSE),IF(F56=\"N/A - Other\",VLOOKUP(D56,'10. Condition and Temporal'!$B$6:$L$103,10,FALSE)))))))","v":""},{"$f":"IF(AE56=\"\",\"\",VLOOKUP(AE56,'11. Lists'!$I$47:$K$80,3,FALSE))","v":""},{"$f":"IF(D56=\"\",\"\",VLOOKUP(D56,'9. All Habitats + Multipliers'!$C$4:$K$102,7,FALSE))","v":""},{"$f":"IF(AG56=\"\",\"\",VLOOKUP(AG56,'11. Lists'!$J$35:$K$38,2,FALSE))","v":""},"1"]
[null,19,"Watercourses",null,{"$f":"IF(D57=\"\",\"\",VLOOKUP(D57,'10. Condition and Temporal'!$B$6:$D$103,3,FALSE))","v":""},{"$nulls":6},"",{"$nulls":7},{"$f":"IF(D57=\"\",\"\",VLOOKUP(D57,'9. All Habitats + Multipliers'!$C$4:$K$102,5,FALSE))","v":""},null,{"$f":"IF(T57=\"\",\"\",VLOOKUP(T57,'11. Lists'!$B$47:$D$49,2,FALSE))","v":""},"",{"$f":"IF(W57=\"\",\"\",VLOOKUP(W57,'11. Lists'!$F$47:$G$51,2,FALSE))","v":""},{"$nulls":3},"",{"$f":"IF(AB57=\"\",\"\",VLOOKUP(AB57,'11. Lists'!$F$36:$H$38,2,FALSE))","v":""},{"$f":"IF(AB57=\"\",\"\",VLOOKUP(AB57,'11. Lists'!$F$36:$H$38,3,FALSE))","v":""},{"$f":"IF(F57=\"\",\"\",IF(F57=\"Moderate\",VLOOKUP(D57,'10. Condition and Temporal'!$B$6:$L$103,6,FALSE),IF(F57=\"Good\",VLOOKUP(D57,'10. Condition and Temporal'!$B$6:$L$103,7,FALSE),IF(F57=\"Poor\",VLOOKUP(D57,'10. Condition and Temporal'!$B$6:$L$103,8,FALSE),IF(F57=\"Condition Assessment N/A\",VLOOKUP(D57,'10. Condition and Temporal'!$B$6:$L$103,9,FALSE),IF(F57=\"N/A - Other\",VLOOKUP(D57,'10. Condition and Temporal'!$B$6:$L$103,10,FALSE)))))))","v":""},{"$f":"IF(AE57=\"\",\"\",VLOOKUP(AE57,'11. Lists'!$I$47:$K$80,3,FALSE))","v":""},{"$f":"IF(D57=\"\",\"\",VLOOKUP(D57,'9. All Habitats + Multipliers'!$C$4:$K$102,7,FALSE))","v":""},{"$f":"IF(AG57=\"\",\"\",VLOOKUP(AG57,'11. Lists'!$J$35:$K$38,2,FALSE))","v":""},"1"]
[null,20,"Watercourses",null,{"$f":"IF(D58=\"\",\"\",VLOOKUP(D58,'10. Condition and Temporal'!$B$6:$D$103,3,FALSE))","v":""},{"$nulls":6},"",{"$nulls":7},{"$f":"IF(D58=\"\",\"\",VLOOKUP(D58,'9. All Habitats + Multipliers'!$C$4:$K$102,5,FALSE))","v":""},null,{"$f":"IF(T58=\"\",\"\",VLOOKUP(T58,'11. Lists'!$B$47:$D$49,2,FALSE))","v":""},"",{"$f":"IF(W58=\"\",\"\",VLOOKUP(W58,'11. Lists'!$F$47:$G$51,2,FALSE))","v":""},{"$nulls":3},"",{"$f":"IF(AB58=\"\",\"\",VLOOKUP(AB58,'11. Lists'!$F$36:$H$38,2,FALSE))","v":""},{"$f":"IF(AB58=\"\",\"\",VLOOKUP(AB58,'11. Lists'!$F$36:$H$38,3,FALSE))","v":""},{"$f":"IF(F58=\"\",\"\",IF(F58=\"Moderate\",VLOOKUP(D58,'10. Condition and Temporal'!$B$6:$L$103,6,FALSE),IF(F58=\"Good\",VLOOKUP(D58,'10. Condition and Temporal'!$B$6:$L$103,7,FALSE),IF(F58=\"Poor\",VLOOKUP(D58,'10. Condition and Temporal'!$B$6:$L$103,8,FALSE),IF(F58=\"Condition Assessment N/A\",VLOOKUP(D58,'10. Condition and Temporal'!$B$6:$L$103,9,FALSE),IF(F58=\"N/A - Other\",VLOOKUP(D58,'10. Condition and Temporal'!$B$6:$L$103,10,FALSE)))))))","v":""},{"$f":"IF(AE58=\"\",\"\",VLOOKUP(AE58,'11. Lists'!$I$47:$K$80,3,FALSE))","v":""},{"$f":"IF(D58=\"\",\"\",VLOOKUP(D58,'9. All Habitats + Multipliers'!$C$4:$K$102,7,FALSE))","v":""},{"$f":"IF(AG58=\"\",\"\",VLOOKUP(AG58,'11. Lists'!$J$35:$K$38,2,FALSE))","v":""},"1"]
[{"$nulls":7},"Totals",{"$f":"SUM(I39:K58)","v":{"v":0,"d":"0.00"}},null,null,{"$f":"SUM(L39:N58)","v":{"v":0,"d":"0.0000"}}]
[]
[{"$nulls":52},"Divider"]
[null,"1c. Habitats to be enhanced",{"$nulls":50},","]
[{"$nulls":52},"Number of options"]
[null,"Baseline ref","Existing Habitat Type",null," Enhanced Habitat type",null,null,"B. Strategic significance","Length Enhanced","Enhanced Condition",null,"Total Units","Net Improvement",null,"Comments",{"$nulls":4},"Baseline Values",{"$nulls":10}," Distinctiveness change acceptable?","Enhanced multipliers",{"$nulls":10},"Condition enhancement - Time to target condition/years","Enhanced multipliers",{"$nulls":9},{"$f":"COUNTIF(BB66:BB85,\"?*\")","v":0},{"$f":"COUNTIF(BC66:BC85,\"?*\")","v":0},0,0,0,0,0,0,0,0,0,0,0,0,0,0,0,0,0,0]
[null,null,"Broad habitat type","Existing habitat type","Enhancement Type","A. Enhanced habitat type",{"$nulls":8},"User comments","LPA comments",{"$nulls":3},"Area enhanced","Baseline distinctiveness band","Baseline distinctiveness score","Baseline condition category","Baseline condition score",{"$nulls":3},"Baseline strategic significance category","Baseline strategic significance score","Baseline value of area enhanced",null,"Area enhanced","Distinctiveness","Score","Condition ","Score",{"$nulls":3},"Strategic significance","Strategic significance","Strategic significance multiplier",null,"Condition enhancement - Time to target multiplier","Distinctiveness enhancement - Time to target condition/years","Distinctiveness enhancement - Time to target multiplier","Difficulty of enhancement category","Difficulty of enhancement multiplier","Acceptable habitat types","Enhancement type","Enhanced watercourse and riparian encroachment",null,"Option number",1,2,3,4,5,6,7,8,9,10,11,12,13,14,15,16,17,18,19,20,"List range","Column ref","list  length"]
[null,1,{"$f":"IF(D66=\"\",\"\",C11)","v":""},{"$f":"IF(OR(K11=\"\", K11=0),\"\",D11)","v":""},{"$f":"IF(AX66=\"\",\"\",AX66)","v":""},null,null,{"$f":"IF(D66=\"\",\"\",AB66)","v":""},{"$f":"IF(OR(K11=\"\",K11=0),\"\",K11)","v":""},{"$f":"IF(F66=\"\",\"\",VLOOKUP(F66,'10. Condition and Temporal'!$B$6:$F$103,5,FALSE))","v":""},null,{"$f":"IFERROR(IF(D66=\"\",\"\",IF(AX66=\"Distinctiveness\",(((((I66*AH66*AJ66*AY66)-(I66*V66*X66))*(AV66*AT66))+(I66*V66*X66))*AP66)/1000,((((I66*AH66*AJ66*AY66)-(I66*V66*X66*AJ11))*(AV66*AR66))+(I66*V66*X66*AJ11))*AP66/1000)),\"This intervention is not permitted within the SSM ▲\")","v":""},{"$f":"IFERROR(IF(F66=\"\",\"\",L66-AD66), \"Error ▲\")","v":""},{"$nulls":6},{"$f":"IF(D66=\"\",\"\",K11)","v":""},{"$f":"IF($D66=\"\",\"\",T11)","v":""},{"$f":"IF($D66=\"\",\"\",V11)","v":""},"","",{"$nulls":3},{"$f":"IF($D66=\"\",\"\",AB11)","v":""},{"$f":"IF($D66=\"\",\"\",AD11)","v":""},{"$f":"IF(AC66=\"\",\"\",((T66*V66*X66)*AC66*AJ11)/1000)","v":""},{"$f":"IF(AD66=\"\",\"\",IF(AH66<V66,\"Not Acceptable\",\"Acceptable\"))","v":""},{"$f":"IF(D66=\"\",\"\",I66)","v":""},{"$f":"IF(D66=\"\",\"\",VLOOKUP(F66,'9. All Habitats + Multipliers'!$C$4:$K$102,5,FALSE))","v":""},{"$f":"IF(AG66=\"\",\"\",VLOOKUP(AG66,'11. Lists'!$B$47:$D$49,2,FALSE))","v":""},{"$f":"IF(D66=\"\",\"\",J66)","v":""},{"$f":"IF(AI66=\"\",\"\",VLOOKUP(AI66,'11. Lists'!$F$47:$G$51,2,FALSE))","v":""},{"$nulls":3},{"$f":"IF(H66=\"\",\"\",H66)","v":""},{"$f":"IF(AN66=\"\",\"\",VLOOKUP(AN66,'11. Lists'!$F$36:$H$38,2,FALSE))","v":""},{"$f":"IF(AN66=\"\",\"\",VLOOKUP(AN66,'11. Lists'!$F$36:$H$38,3,FALSE))","v":""},{"$f":"IF(D66=\"\",\"\",IF(AX66=\"Distinctiveness\",\"N/A\",VLOOKUP(F66,'10. Condition and Temporal'!$B$6:$L$103,11,FALSE)))","v":""},{"$f":"IF(AQ66=\"\",\"\",IF(AQ66=\"N/A\",\"1\",VLOOKUP(AQ66,'11. Lists'!$I$47:$K$80,3,FALSE)))","v":""},{"$f":"IF(D66=\"\",\"\",IF(AX66=\"Condition\",\"N/A\",VLOOKUP(F66,'10. Condition and Temporal'!$B$6:$M$106,12,FALSE)))","v":""},{"$f":"IF(AS66=\"\",\"\",IF(AS66=\"N/A\",\"1\",VLOOKUP(AS66,'11. Lists'!$I$47:$K$80,3,FALSE)))","v":""},{"$f":"IF(D66=\"\",\"\",VLOOKUP(F66,'9. All Habitats + Multipliers'!$C$4:$K$102,8,FALSE))","v":""},{"$f":"IF(AU66=\"\",\"\",VLOOKUP(AU66,'11. Lists'!$J$35:$K$38,2,FALSE))","v":""},{"$f":"IF(D66=\"\",\"\",VLOOKUP(D66,'10. Condition and Temporal'!$B$6:$M$103,4,FALSE))","v":""},{"$f":"IF(F66=\"\",\"\",IF(D66=F66,\"Condition\",\"Distinctiveness\"))","v":""},{"$f":"IF($F$66:$G$85=\"Culvert\",\"0.68\",\"1\")","v":"1"},"1",1,{"$f":"TRIM(MID(SUBSTITUTE($AW$66,$BA$62,REPT(\" \",LEN($AW$66))),($BA66-1)*LEN($AW$66)+1,LEN($AW$66)))","v":""},{"$f":"TRIM(MID(SUBSTITUTE($AW$67,$BA$62,REPT(\" \",LEN($AW$67))),($BA66-1)*LEN($AW$67)+1,LEN($AW$67)))","v":""},{"$f":"TRIM(MID(SUBSTITUTE($AW$68,$BA$62,REPT(\" \",LEN($AW$68))),($BA66-1)*LEN($AW$68)+1,LEN($AW$68)))","v":""},{"$f":"TRIM(MID(SUBSTITUTE($AW$69,$BA$62,REPT(\" \",LEN($AW$69))),($BA66-1)*LEN($AW$69)+1,LEN($AW$69)))","v":""},{"$f":"TRIM(MID(SUBSTITUTE($AW$70,$BA$62,REPT(\" \",LEN($AW$70))),($BA66-1)*LEN($AW$70)+1,LEN($AW$70)))","v":""},{"$f":"TRIM(MID(SUBSTITUTE($AW$71,$BA$62,REPT(\" \",LEN($AW$71))),($BA66-1)*LEN($AW$71)+1,LEN($AW$71)))","v":""},{"$f":"TRIM(MID(SUBSTITUTE($AW$72,$BA$62,REPT(\" \",LEN($AW$72))),($BA66-1)*LEN($AW$72)+1,LEN($AW$72)))","v":""},{"$f":"TRIM(MID(SUBSTITUTE($AW$73,$BA$62,REPT(\" \",LEN($AW$73))),($BA66-1)*LEN($AW$73)+1,LEN($AW$73)))","v":""},{"$f":"TRIM(MID(SUBSTITUTE($AW$74,$BA$62,REPT(\" \",LEN($AW$74))),($BA66-1)*LEN($AW$74)+1,LEN($AW$74)))","v":""},{"$f":"TRIM(MID(SUBSTITUTE($AW$75,$BA$62,REPT(\" \",LEN($AW$75))),($BA66-1)*LEN($AW$75)+1,LEN($AW$75)))","v":""},{"$f":"TRIM(MID(SUBSTITUTE($AW$76,$BA$62,REPT(\" \",LEN($AW$76))),($BA66-1)*LEN($AW$76)+1,LEN($AW$76)))","v":""},{"$f":"TRIM(MID(SUBSTITUTE($AW$77,$BA$62,REPT(\" \",LEN($AW$77))),($BA66-1)*LEN($AW$77)+1,LEN($AW$77)))","v":""},{"$f":"TRIM(MID(SUBSTITUTE($AW$78,$BA$62,REPT(\" \",LEN($AW$78))),($BA66-1)*LEN($AW$78)+1,LEN($AW$78)))","v":""},{"$f":"TRIM(MID(SUBSTITUTE($AW$79,$BA$62,REPT(\" \",LEN($AW$79))),($BA66-1)*LEN($AW$79)+1,LEN($AW$79)))","v":""},{"$f":"TRIM(MID(SUBSTITUTE($AW$80,$BA$62,REPT(\" \",LEN($AW$80))),($BA66-1)*LEN($AW$80)+1,LEN($AW$80)))","v":""},{"$f":"TRIM(MID(SUBSTITUTE($AW$81,$BA$62,REPT(\" \",LEN($AW$81))),($BA66-1)*LEN($AW$81)+1,LEN($AW$81)))","v":""},{"$f":"TRIM(MID(SUBSTITUTE($AW$82,$BA$62,REPT(\" \",LEN($AW$82))),($BA66-1)*LEN($AW$82)+1,LEN($AW$82)))","v":""},{"$f":"TRIM(MID(SUBSTITUTE($AW$83,$BA$62,REPT(\" \",LEN($AW$83))),($BA66-1)*LEN($AW$83)+1,LEN($AW$83)))","v":""},{"$f":"TRIM(MID(SUBSTITUTE($AW$84,$BA$62,REPT(\" \",LEN($AW$84))),($BA66-1)*LEN($AW$84)+1,LEN($AW$84)))","v":""},{"$f":"TRIM(MID(SUBSTITUTE($AW$85,$BA$62,REPT(\" \",LEN($AW$85))),($BA66-1)*LEN($AW$85)+1,LEN($AW$85)))","v":""},{"$f":"IF(BX66=0,\"\",CONCATENATE(BW66,\"66:\",BW66,BX66+65))","v":""},"BB",{"$f":"BB64","v":0}]
[null,2,"",{"$f":"IF(OR(K12=\"\", K12=0),\"\",D12)","v":""},"",null,null,"",{"$f":"IF(OR(K12=\"\",K12=0),\"\",K12)","v":""},{"$f":"IF(F67=\"\",\"\",VLOOKUP(F67,'10. Condition and Temporal'!$B$6:$F$103,5,FALSE))","v":""},null,{"$f":"IFERROR(IF(D67=\"\",\"\",IF(AX67=\"Distinctiveness\",(((((I67*AH67*AJ67*AY67)-(I67*V67*X67))*(AV67*AT67))+(I67*V67*X67))*AP67)/1000,((((I67*AH67*AJ67*AY67)-(I67*V67*X67*AJ12))*(AV67*AR67))+(I67*V67*X67*AJ12))*AP67/1000)),\"This intervention is not permitted within the SSM ▲\")","v":""},{"$f":"IFERROR(IF(F67=\"\",\"\",L67-AD67), \"Error ▲\")","v":""},{"$nulls":6},"",{"$f":"IF($D67=\"\",\"\",T12)","v":""},"","","",{"$nulls":3},"","",{"$f":"IF(AC67=\"\",\"\",((T67*V67*X67)*AC67*AJ12)/1000)","v":""},{"$f":"IF(AD67=\"\",\"\",IF(AH67<V67,\"Not Acceptable\",\"Acceptable\"))","v":""},"",{"$f":"IF(D67=\"\",\"\",VLOOKUP(F67,'9. All Habitats + Multipliers'!$C$4:$K$102,5,FALSE))","v":""},{"$f":"IF(AG67=\"\",\"\",VLOOKUP(AG67,'11. Lists'!$B$47:$D$49,2,FALSE))","v":""},"",{"$f":"IF(AI67=\"\",\"\",VLOOKUP(AI67,'11. Lists'!$F$47:$G$51,2,FALSE))","v":""},{"$nulls":3},"",{"$f":"IF(AN67=\"\",\"\",VLOOKUP(AN67,'11. Lists'!$F$36:$H$38,2,FALSE))","v":""},{"$f":"IF(AN67=\"\",\"\",VLOOKUP(AN67,'11. Lists'!$F$36:$H$38,3,FALSE))","v":""},{"$f":"IF(D67=\"\",\"\",IF(AX67=\"Distinctiveness\",\"N/A\",VLOOKUP(F67,'10. Condition and Temporal'!$B$6:$L$103,11,FALSE)))","v":""},{"$f":"IF(AQ67=\"\",\"\",IF(AQ67=\"N/A\",\"1\",VLOOKUP(AQ67,'11. Lists'!$I$47:$K$80,3,FALSE)))","v":""},{"$f":"IF(D67=\"\",\"\",IF(AX67=\"Condition\",\"N/A\",VLOOKUP(F67,'10. Condition and Temporal'!$B$6:$M$106,12,FALSE)))","v":""},{"$f":"IF(AS67=\"\",\"\",IF(AS67=\"N/A\",\"1\",VLOOKUP(AS67,'11. Lists'!$I$47:$K$80,3,FALSE)))","v":""},{"$f":"IF(D67=\"\",\"\",VLOOKUP(F67,'9. All Habitats + Multipliers'!$C$4:$K$102,8,FALSE))","v":""},{"$f":"IF(AU67=\"\",\"\",VLOOKUP(AU67,'11. Lists'!$J$35:$K$38,2,FALSE))","v":""},{"$f":"IF(D67=\"\",\"\",VLOOKUP(D67,'10. Condition and Temporal'!$B$6:$M$103,4,FALSE))","v":""},"","1","1",2,"","","","","","","","","","","","","","","","","","","","",{"$f":"IF(BX67=0,\"\",CONCATENATE(BW67,\"66:\",BW67,BX67+65))","v":""},"BC",{"$f":"BC64","v":0}]
[null,3,"","","",null,null,"","",{"$f":"IF(F68=\"\",\"\",VLOOKUP(F68,'10. Condition and Temporal'!$B$6:$F$103,5,FALSE))","v":""},null,"","",{"$nulls":6},"","","","","",{"$nulls":3},"","","","","",{"$f":"IF(D68=\"\",\"\",VLOOKUP(F68,'9. All Habitats + Multipliers'!$C$4:$K$102,5,FALSE))","v":""},{"$f":"IF(AG68=\"\",\"\",VLOOKUP(AG68,'11. Lists'!$B$47:$D$49,2,FALSE))","v":""},"",{"$f":"IF(AI68=\"\",\"\",VLOOKUP(AI68,'11. Lists'!$F$47:$G$51,2,FALSE))","v":""},{"$nulls":3},"",{"$f":"IF(AN68=\"\",\"\",VLOOKUP(AN68,'11. Lists'!$F$36:$H$38,2,FALSE))","v":""},{"$f":"IF(AN68=\"\",\"\",VLOOKUP(AN68,'11. Lists'!$F$36:$H$38,3,FALSE))","v":""},{"$f":"IF(D68=\"\",\"\",IF(AX68=\"Distinctiveness\",\"N/A\",VLOOKUP(F68,'10. Condition and Temporal'!$B$6:$L$103,11,FALSE)))","v":""},{"$f":"IF(AQ68=\"\",\"\",IF(AQ68=\"N/A\",\"1\",VLOOKUP(AQ68,'11. Lists'!$I$47:$K$80,3,FALSE)))","v":""},{"$f":"IF(D68=\"\",\"\",IF(AX68=\"Condition\",\"N/A\",VLOOKUP(F68,'10. Condition and Temporal'!$B$6:$M$106,12,FALSE)))","v":""},{"$f":"IF(AS68=\"\",\"\",IF(AS68=\"N/A\",\"1\",VLOOKUP(AS68,'11. Lists'!$I$47:$K$80,3,FALSE)))","v":""},{"$f":"IF(D68=\"\",\"\",VLOOKUP(F68,'9. All Habitats + Multipliers'!$C$4:$K$102,8,FALSE))","v":""},{"$f":"IF(AU68=\"\",\"\",VLOOKUP(AU68,'11. Lists'!$J$35:$K$38,2,FALSE))","v":""},{"$f":"IF(D68=\"\",\"\",VLOOKUP(D68,'10. Condition and Temporal'!$B$6:$M$103,4,FALSE))","v":""},"","1","1",3,"","","","","","","","","","","","","","","","","","","","","","BD",{"$f":"BD64","v":0}]
[null,4,"","","",null,null,"","",{"$f":"IF(F69=\"\",\"\",VLOOKUP(F69,'10. Condition and Temporal'!$B$6:$F$103,5,FALSE))","v":""},null,"","",{"$nulls":6},"","","","","",{"$nulls":3},"","","","","",{"$f":"IF(D69=\"\",\"\",VLOOKUP(F69,'9. All Habitats + Multipliers'!$C$4:$K$102,5,FALSE))","v":""},{"$f":"IF(AG69=\"\",\"\",VLOOKUP(AG69,'11. Lists'!$B$47:$D$49,2,FALSE))","v":""},"",{"$f":"IF(AI69=\"\",\"\",VLOOKUP(AI69,'11. Lists'!$F$47:$G$51,2,FALSE))","v":""},{"$nulls":3},"",{"$f":"IF(AN69=\"\",\"\",VLOOKUP(AN69,'11. Lists'!$F$36:$H$38,2,FALSE))","v":""},{"$f":"IF(AN69=\"\",\"\",VLOOKUP(AN69,'11. Lists'!$F$36:$H$38,3,FALSE))","v":""},{"$f":"IF(D69=\"\",\"\",IF(AX69=\"Distinctiveness\",\"N/A\",VLOOKUP(F69,'10. Condition and Temporal'!$B$6:$L$103,11,FALSE)))","v":""},{"$f":"IF(AQ69=\"\",\"\",IF(AQ69=\"N/A\",\"1\",VLOOKUP(AQ69,'11. Lists'!$I$47:$K$80,3,FALSE)))","v":""},{"$f":"IF(D69=\"\",\"\",IF(AX69=\"Condition\",\"N/A\",VLOOKUP(F69,'10. Condition and Temporal'!$B$6:$M$106,12,FALSE)))","v":""},{"$f":"IF(AS69=\"\",\"\",IF(AS69=\"N/A\",\"1\",VLOOKUP(AS69,'11. Lists'!$I$47:$K$80,3,FALSE)))","v":""},{"$f":"IF(D69=\"\",\"\",VLOOKUP(F69,'9. All Habitats + Multipliers'!$C$4:$K$102,8,FALSE))","v":""},{"$f":"IF(AU69=\"\",\"\",VLOOKUP(AU69,'11. Lists'!$J$35:$K$38,2,FALSE))","v":""},{"$f":"IF(D69=\"\",\"\",VLOOKUP(D69,'10. Condition and Temporal'!$B$6:$M$103,4,FALSE))","v":""},"","1","1",4,"","","","","","","","","","","","","","","","","","","","","","BE",{"$f":"BE64","v":0}]
[null,5,"","","",null,null,"","",{"$f":"IF(F70=\"\",\"\",VLOOKUP(F70,'10. Condition and Temporal'!$B$6:$F$103,5,FALSE))","v":""},null,"","",{"$nulls":6},"","","","","",{"$nulls":3},"","","","","",{"$f":"IF(D70=\"\",\"\",VLOOKUP(F70,'9. All Habitats + Multipliers'!$C$4:$K$102,5,FALSE))","v":""},{"$f":"IF(AG70=\"\",\"\",VLOOKUP(AG70,'11. Lists'!$B$47:$D$49,2,FALSE))","v":""},"",{"$f":"IF(AI70=\"\",\"\",VLOOKUP(AI70,'11. Lists'!$F$47:$G$51,2,FALSE))","v":""},{"$nulls":3},"",{"$f":"IF(AN70=\"\",\"\",VLOOKUP(AN70,'11. Lists'!$F$36:$H$38,2,FALSE))","v":""},{"$f":"IF(AN70=\"\",\"\",VLOOKUP(AN70,'11. Lists'!$F$36:$H$38,3,FALSE))","v":""},{"$f":"IF(D70=\"\",\"\",IF(AX70=\"Distinctiveness\",\"N/A\",VLOOKUP(F70,'10. Condition and Temporal'!$B$6:$L$103,11,FALSE)))","v":""},{"$f":"IF(AQ70=\"\",\"\",IF(AQ70=\"N/A\",\"1\",VLOOKUP(AQ70,'11. Lists'!$I$47:$K$80,3,FALSE)))","v":""},{"$f":"IF(D70=\"\",\"\",IF(AX70=\"Condition\",\"N/A\",VLOOKUP(F70,'10. Condition and Temporal'!$B$6:$M$106,12,FALSE)))","v":""},{"$f":"IF(AS70=\"\",\"\",IF(AS70=\"N/A\",\"1\",VLOOKUP(AS70,'11. Lists'!$I$47:$K$80,3,FALSE)))","v":""},{"$f":"IF(D70=\"\",\"\",VLOOKUP(F70,'9. All Habitats + Multipliers'!$C$4:$K$102,8,FALSE))","v":""},{"$f":"IF(AU70=\"\",\"\",VLOOKUP(AU70,'11. Lists'!$J$35:$K$38,2,FALSE))","v":""},{"$f":"IF(D70=\"\",\"\",VLOOKUP(D70,'10. Condition and Temporal'!$B$6:$M$103,4,FALSE))","v":""},"","1","1",5,"","","","","","","","","","","","","","","","","","","","","","BF",{"$f":"BF64","v":0}]
[null,6,"","","",null,null,"","",{"$f":"IF(F71=\"\",\"\",VLOOKUP(F71,'10. Condition and Temporal'!$B$6:$F$103,5,FALSE))","v":""},null,"","",{"$nulls":6},"","","","","",{"$nulls":3},"","","","","",{"$f":"IF(D71=\"\",\"\",VLOOKUP(F71,'9. All Habitats + Multipliers'!$C$4:$K$102,5,FALSE))","v":""},{"$f":"IF(AG71=\"\",\"\",VLOOKUP(AG71,'11. Lists'!$B$47:$D$49,2,FALSE))","v":""},"",{"$f":"IF(AI71=\"\",\"\",VLOOKUP(AI71,'11. Lists'!$F$47:$G$51,2,FALSE))","v":""},{"$nulls":3},"",{"$f":"IF(AN71=\"\",\"\",VLOOKUP(AN71,'11. Lists'!$F$36:$H$38,2,FALSE))","v":""},{"$f":"IF(AN71=\"\",\"\",VLOOKUP(AN71,'11. Lists'!$F$36:$H$38,3,FALSE))","v":""},{"$f":"IF(D71=\"\",\"\",IF(AX71=\"Distinctiveness\",\"N/A\",VLOOKUP(F71,'10. Condition and Temporal'!$B$6:$L$103,11,FALSE)))","v":""},{"$f":"IF(AQ71=\"\",\"\",IF(AQ71=\"N/A\",\"1\",VLOOKUP(AQ71,'11. Lists'!$I$47:$K$80,3,FALSE)))","v":""},{"$f":"IF(D71=\"\",\"\",IF(AX71=\"Condition\",\"N/A\",VLOOKUP(F71,'10. Condition and Temporal'!$B$6:$M$106,12,FALSE)))","v":""},{"$f":"IF(AS71=\"\",\"\",IF(AS71=\"N/A\",\"1\",VLOOKUP(AS71,'11. Lists'!$I$47:$K$80,3,FALSE)))","v":""},{"$f":"IF(D71=\"\",\"\",VLOOKUP(F71,'9. All Habitats + Multipliers'!$C$4:$K$102,8,FALSE))","v":""},{"$f":"IF(AU71=\"\",\"\",VLOOKUP(AU71,'11. Lists'!$J$35:$K$38,2,FALSE))","v":""},{"$f":"IF(D71=\"\",\"\",VLOOKUP(D71,'10. Condition and Temporal'!$B$6:$M$103,4,FALSE))","v":""},"","1","1",6,"","","","","","","","","","","","","","","","","","","","","","BG",{"$f":"BG64","v":0}]
[null,7,"","","",null,null,"","",{"$f":"IF(F72=\"\",\"\",VLOOKUP(F72,'10. Condition and Temporal'!$B$6:$F$103,5,FALSE))","v":""},null,"","",{"$nulls":6},"","","","","",{"$nulls":3},"","","","","",{"$f":"IF(D72=\"\",\"\",VLOOKUP(F72,'9. All Habitats + Multipliers'!$C$4:$K$102,5,FALSE))","v":""},{"$f":"IF(AG72=\"\",\"\",VLOOKUP(AG72,'11. Lists'!$B$47:$D$49,2,FALSE))","v":""},"",{"$f":"IF(AI72=\"\",\"\",VLOOKUP(AI72,'11. Lists'!$F$47:$G$51,2,FALSE))","v":""},{"$nulls":3},"",{"$f":"IF(AN72=\"\",\"\",VLOOKUP(AN72,'11. Lists'!$F$36:$H$38,2,FALSE))","v":""},{"$f":"IF(AN72=\"\",\"\",VLOOKUP(AN72,'11. Lists'!$F$36:$H$38,3,FALSE))","v":""},{"$f":"IF(D72=\"\",\"\",IF(AX72=\"Distinctiveness\",\"N/A\",VLOOKUP(F72,'10. Condition and Temporal'!$B$6:$L$103,11,FALSE)))","v":""},{"$f":"IF(AQ72=\"\",\"\",IF(AQ72=\"N/A\",\"1\",VLOOKUP(AQ72,'11. Lists'!$I$47:$K$80,3,FALSE)))","v":""},{"$f":"IF(D72=\"\",\"\",IF(AX72=\"Condition\",\"N/A\",VLOOKUP(F72,'10. Condition and Temporal'!$B$6:$M$106,12,FALSE)))","v":""},{"$f":"IF(AS72=\"\",\"\",IF(AS72=\"N/A\",\"1\",VLOOKUP(AS72,'11. Lists'!$I$47:$K$80,3,FALSE)))","v":""},{"$f":"IF(D72=\"\",\"\",VLOOKUP(F72,'9. All Habitats + Multipliers'!$C$4:$K$102,8,FALSE))","v":""},{"$f":"IF(AU72=\"\",\"\",VLOOKUP(AU72,'11. Lists'!$J$35:$K$38,2,FALSE))","v":""},{"$f":"IF(D72=\"\",\"\",VLOOKUP(D72,'10. Condition and Temporal'!$B$6:$M$103,4,FALSE))","v":""},"","1","1",7,"","","","","","","","","","","","","","","","","","","","","","BH",{"$f":"BH64","v":0}]
[null,8,"","","",null,null,"","",{"$f":"IF(F73=\"\",\"\",VLOOKUP(F73,'10. Condition and Temporal'!$B$6:$F$103,5,FALSE))","v":""},null,"","",{"$nulls":6},"","","","","",{"$nulls":3},"","","","","",{"$f":"IF(D73=\"\",\"\",VLOOKUP(F73,'9. All Habitats + Multipliers'!$C$4:$K$102,5,FALSE))","v":""},{"$f":"IF(AG73=\"\",\"\",VLOOKUP(AG73,'11. Lists'!$B$47:$D$49,2,FALSE))","v":""},"",{"$f":"IF(AI73=\"\",\"\",VLOOKUP(AI73,'11. Lists'!$F$47:$G$51,2,FALSE))","v":""},{"$nulls":3},"",{"$f":"IF(AN73=\"\",\"\",VLOOKUP(AN73,'11. Lists'!$F$36:$H$38,2,FALSE))","v":""},{"$f":"IF(AN73=\"\",\"\",VLOOKUP(AN73,'11. Lists'!$F$36:$H$38,3,FALSE))","v":""},{"$f":"IF(D73=\"\",\"\",IF(AX73=\"Distinctiveness\",\"N/A\",VLOOKUP(F73,'10. Condition and Temporal'!$B$6:$L$103,11,FALSE)))","v":""},{"$f":"IF(AQ73=\"\",\"\",IF(AQ73=\"N/A\",\"1\",VLOOKUP(AQ73,'11. Lists'!$I$47:$K$80,3,FALSE)))","v":""},{"$f":"IF(D73=\"\",\"\",IF(AX73=\"Condition\",\"N/A\",VLOOKUP(F73,'10. Condition and Temporal'!$B$6:$M$106,12,FALSE)))","v":""},{"$f":"IF(AS73=\"\",\"\",IF(AS73=\"N/A\",\"1\",VLOOKUP(AS73,'11. Lists'!$I$47:$K$80,3,FALSE)))","v":""},{"$f":"IF(D73=\"\",\"\",VLOOKUP(F73,'9. All Habitats + Multipliers'!$C$4:$K$102,8,FALSE))","v":""},{"$f":"IF(AU73=\"\",\"\",VLOOKUP(AU73,'11. Lists'!$J$35:$K$38,2,FALSE))","v":""},{"$f":"IF(D73=\"\",\"\",VLOOKUP(D73,'10. Condition and Temporal'!$B$6:$M$103,4,FALSE))","v":""},"","1","1",8,"","","","","","","","","","","","","","","","","","","","","","BI",{"$f":"BI64","v":0}]
[null,9,"","","",null,null,"","",{"$f":"IF(F74=\"\",\"\",VLOOKUP(F74,'10. Condition and Temporal'!$B$6:$F$103,5,FALSE))","v":""},null,"","",{"$nulls":6},"","","","","",{"$nulls":3},"","","","","",{"$f":"IF(D74=\"\",\"\",VLOOKUP(F74,'9. All Habitats + Multipliers'!$C$4:$K$102,5,FALSE))","v":""},{"$f":"IF(AG74=\"\",\"\",VLOOKUP(AG74,'11. Lists'!$B$47:$D$49,2,FALSE))","v":""},"",{"$f":"IF(AI74=\"\",\"\",VLOOKUP(AI74,'11. Lists'!$F$47:$G$51,2,FALSE))","v":""},{"$nulls":3},"",{"$f":"IF(AN74=\"\",\"\",VLOOKUP(AN74,'11. Lists'!$F$36:$H$38,2,FALSE))","v":""},{"$f":"IF(AN74=\"\",\"\",VLOOKUP(AN74,'11. Lists'!$F$36:$H$38,3,FALSE))","v":""},{"$f":"IF(D74=\"\",\"\",IF(AX74=\"Distinctiveness\",\"N/A\",VLOOKUP(F74,'10. Condition and Temporal'!$B$6:$L$103,11,FALSE)))","v":""},{"$f":"IF(AQ74=\"\",\"\",IF(AQ74=\"N/A\",\"1\",VLOOKUP(AQ74,'11. Lists'!$I$47:$K$80,3,FALSE)))","v":""},{"$f":"IF(D74=\"\",\"\",IF(AX74=\"Condition\",\"N/A\",VLOOKUP(F74,'10. Condition and Temporal'!$B$6:$M$106,12,FALSE)))","v":""},{"$f":"IF(AS74=\"\",\"\",IF(AS74=\"N/A\",\"1\",VLOOKUP(AS74,'11. Lists'!$I$47:$K$80,3,FALSE)))","v":""},{"$f":"IF(D74=\"\",\"\",VLOOKUP(F74,'9. All Habitats + Multipliers'!$C$4:$K$102,8,FALSE))","v":""},{"$f":"IF(AU74=\"\",\"\",VLOOKUP(AU74,'11. Lists'!$J$35:$K$38,2,FALSE))","v":""},{"$f":"IF(D74=\"\",\"\",VLOOKUP(D74,'10. Condition and Temporal'!$B$6:$M$103,4,FALSE))","v":""},"","1","1",9,"","","","","","","","","","","","","","","","","","","","","","BJ",{"$f":"BJ64","v":0}]
[null,10,"","","",null,null,"","",{"$f":"IF(F75=\"\",\"\",VLOOKUP(F75,'10. Condition and Temporal'!$B$6:$F$103,5,FALSE))","v":""},null,"","",{"$nulls":6},"","","","","",{"$nulls":3},"","","","","",{"$f":"IF(D75=\"\",\"\",VLOOKUP(F75,'9. All Habitats + Multipliers'!$C$4:$K$102,5,FALSE))","v":""},{"$f":"IF(AG75=\"\",\"\",VLOOKUP(AG75,'11. Lists'!$B$47:$D$49,2,FALSE))","v":""},"",{"$f":"IF(AI75=\"\",\"\",VLOOKUP(AI75,'11. Lists'!$F$47:$G$51,2,FALSE))","v":""},{"$nulls":3},"",{"$f":"IF(AN75=\"\",\"\",VLOOKUP(AN75,'11. Lists'!$F$36:$H$38,2,FALSE))","v":""},{"$f":"IF(AN75=\"\",\"\",VLOOKUP(AN75,'11. Lists'!$F$36:$H$38,3,FALSE))","v":""},{"$f":"IF(D75=\"\",\"\",IF(AX75=\"Distinctiveness\",\"N/A\",VLOOKUP(F75,'10. Condition and Temporal'!$B$6:$L$103,11,FALSE)))","v":""},{"$f":"IF(AQ75=\"\",\"\",IF(AQ75=\"N/A\",\"1\",VLOOKUP(AQ75,'11. Lists'!$I$47:$K$80,3,FALSE)))","v":""},{"$f":"IF(D75=\"\",\"\",IF(AX75=\"Condition\",\"N/A\",VLOOKUP(F75,'10. Condition and Temporal'!$B$6:$M$106,12,FALSE)))","v":""},{"$f":"IF(AS75=\"\",\"\",IF(AS75=\"N/A\",\"1\",VLOOKUP(AS75,'11. Lists'!$I$47:$K$80,3,FALSE)))","v":""},{"$f":"IF(D75=\"\",\"\",VLOOKUP(F75,'9. All Habitats + Multipliers'!$C$4:$K$102,8,FALSE))","v":""},{"$f":"IF(AU75=\"\",\"\",VLOOKUP(AU75,'11. Lists'!$J$35:$K$38,2,FALSE))","v":""},{"$f":"IF(D75=\"\",\"\",VLOOKUP(D75,'10. Condition and Temporal'!$B$6:$M$103,4,FALSE))","v":""},"","1","1",10,"","","","","","","","","","","","","","","","","","","","","","BK",{"$f":"BK64","v":0}]
[null,11,"","","",null,null,"","",{"$f":"IF(F76=\"\",\"\",VLOOKUP(F76,'10. Condition and Temporal'!$B$6:$F$103,5,FALSE))","v":""},null,"","",{"$nulls":6},"","","","","",{"$nulls":3},"","","","","",{"$f":"IF(D76=\"\",\"\",VLOOKUP(F76,'9. All Habitats + Multipliers'!$C$4:$K$102,5,FALSE))","v":""},{"$f":"IF(AG76=\"\",\"\",VLOOKUP(AG76,'11. Lists'!$B$47:$D$49,2,FALSE))","v":""},"",{"$f":"IF(AI76=\"\",\"\",VLOOKUP(AI76,'11. Lists'!$F$47:$G$51,2,FALSE))","v":""},{"$nulls":3},"",{"$f":"IF(AN76=\"\",\"\",VLOOKUP(AN76,'11. Lists'!$F$36:$H$38,2,FALSE))","v":""},{"$f":"IF(AN76=\"\",\"\",VLOOKUP(AN76,'11. Lists'!$F$36:$H$38,3,FALSE))","v":""},{"$f":"IF(D76=\"\",\"\",IF(AX76=\"Distinctiveness\",\"N/A\",VLOOKUP(F76,'10. Condition and Temporal'!$B$6:$L$103,11,FALSE)))","v":""},{"$f":"IF(AQ76=\"\",\"\",IF(AQ76=\"N/A\",\"1\",VLOOKUP(AQ76,'11. Lists'!$I$47:$K$80,3,FALSE)))","v":""},{"$f":"IF(D76=\"\",\"\",IF(AX76=\"Condition\",\"N/A\",VLOOKUP(F76,'10. Condition and Temporal'!$B$6:$M$106,12,FALSE)))","v":""},{"$f":"IF(AS76=\"\",\"\",IF(AS76=\"N/A\",\"1\",VLOOKUP(AS76,'11. Lists'!$I$47:$K$80,3,FALSE)))","v":""},{"$f":"IF(D76=\"\",\"\",VLOOKUP(F76,'9. All Habitats + Multipliers'!$C$4:$K$102,8,FALSE))","v":""},{"$f":"IF(AU76=\"\",\"\",VLOOKUP(AU76,'11. Lists'!$J$35:$K$38,2,FALSE))","v":""},{"$f":"IF(D76=\"\",\"\",VLOOKUP(D76,'10. Condition and Temporal'!$B$6:$M$103,4,FALSE))","v":""},"","1","1",11,"","","","","","","","","","","","","","","","","","","","","","BL",{"$f":"BL64","v":0}]
[null,12,"","","",null,null,"","",{"$f":"IF(F77=\"\",\"\",VLOOKUP(F77,'10. Condition and Temporal'!$B$6:$F$103,5,FALSE))","v":""},null,"","",{"$nulls":6},"","","","","",{"$nulls":3},"","","","","",{"$f":"IF(D77=\"\",\"\",VLOOKUP(F77,'9. All Habitats + Multipliers'!$C$4:$K$102,5,FALSE))","v":""},{"$f":"IF(AG77=\"\",\"\",VLOOKUP(AG77,'11. Lists'!$B$47:$D$49,2,FALSE))","v":""},"",{"$f":"IF(AI77=\"\",\"\",VLOOKUP(AI77,'11. Lists'!$F$47:$G$51,2,FALSE))","v":""},{"$nulls":3},"",{"$f":"IF(AN77=\"\",\"\",VLOOKUP(AN77,'11. Lists'!$F$36:$H$38,2,FALSE))","v":""},{"$f":"IF(AN77=\"\",\"\",VLOOKUP(AN77,'11. Lists'!$F$36:$H$38,3,FALSE))","v":""},{"$f":"IF(D77=\"\",\"\",IF(AX77=\"Distinctiveness\",\"N/A\",VLOOKUP(F77,'10. Condition and Temporal'!$B$6:$L$103,11,FALSE)))","v":""},{"$f":"IF(AQ77=\"\",\"\",IF(AQ77=\"N/A\",\"1\",VLOOKUP(AQ77,'11. Lists'!$I$47:$K$80,3,FALSE)))","v":""},{"$f":"IF(D77=\"\",\"\",IF(AX77=\"Condition\",\"N/A\",VLOOKUP(F77,'10. Condition and Temporal'!$B$6:$M$106,12,FALSE)))","v":""},{"$f":"IF(AS77=\"\",\"\",IF(AS77=\"N/A\",\"1\",VLOOKUP(AS77,'11. Lists'!$I$47:$K$80,3,FALSE)))","v":""},{"$f":"IF(D77=\"\",\"\",VLOOKUP(F77,'9. All Habitats + Multipliers'!$C$4:$K$102,8,FALSE))","v":""},{"$f":"IF(AU77=\"\",\"\",VLOOKUP(AU77,'11. Lists'!$J$35:$K$38,2,FALSE))","v":""},{"$f":"IF(D77=\"\",\"\",VLOOKUP(D77,'10. Condition and Temporal'!$B$6:$M$103,4,FALSE))","v":""},"","1","1",12,"","","","","","","","","","","","","","","","","","","","","","BM",{"$f":"BM64","v":0}]
[null,13,"","","",null,null,"","",{"$f":"IF(F78=\"\",\"\",VLOOKUP(F78,'10. Condition and Temporal'!$B$6:$F$103,5,FALSE))","v":""},null,"","",{"$nulls":6},"","","","","",{"$nulls":3},"","","","","",{"$f":"IF(D78=\"\",\"\",VLOOKUP(F78,'9. All Habitats + Multipliers'!$C$4:$K$102,5,FALSE))","v":""},{"$f":"IF(AG78=\"\",\"\",VLOOKUP(AG78,'11. Lists'!$B$47:$D$49,2,FALSE))","v":""},"",{"$f":"IF(AI78=\"\",\"\",VLOOKUP(AI78,'11. Lists'!$F$47:$G$51,2,FALSE))","v":""},{"$nulls":3},"",{"$f":"IF(AN78=\"\",\"\",VLOOKUP(AN78,'11. Lists'!$F$36:$H$38,2,FALSE))","v":""},{"$f":"IF(AN78=\"\",\"\",VLOOKUP(AN78,'11. Lists'!$F$36:$H$38,3,FALSE))","v":""},{"$f":"IF(D78=\"\",\"\",IF(AX78=\"Distinctiveness\",\"N/A\",VLOOKUP(F78,'10. Condition and Temporal'!$B$6:$L$103,11,FALSE)))","v":""},{"$f":"IF(AQ78=\"\",\"\",IF(AQ78=\"N/A\",\"1\",VLOOKUP(AQ78,'11. Lists'!$I$47:$K$80,3,FALSE)))","v":""},{"$f":"IF(D78=\"\",\"\",IF(AX78=\"Condition\",\"N/A\",VLOOKUP(F78,'10. Condition and Temporal'!$B$6:$M$106,12,FALSE)))","v":""},{"$f":"IF(AS78=\"\",\"\",IF(AS78=\"N/A\",\"1\",VLOOKUP(AS78,'11. Lists'!$I$47:$K$80,3,FALSE)))","v":""},{"$f":"IF(D78=\"\",\"\",VLOOKUP(F78,'9. All Habitats + Multipliers'!$C$4:$K$102,8,FALSE))","v":""},{"$f":"IF(AU78=\"\",\"\",VLOOKUP(AU78,'11. Lists'!$J$35:$K$38,2,FALSE))","v":""},{"$f":"IF(D78=\"\",\"\",VLOOKUP(D78,'10. Condition and Temporal'!$B$6:$M$103,4,FALSE))","v":""},"","1","1",13,"","","","","","","","","","","","","","","","","","","","","","BN",{"$f":"BN64","v":0}]
[null,14,"","","",null,null,"","",{"$f":"IF(F79=\"\",\"\",VLOOKUP(F79,'10. Condition and Temporal'!$B$6:$F$103,5,FALSE))","v":""},null,"","",{"$nulls":6},"","","","","",{"$nulls":3},"","","","","",{"$f":"IF(D79=\"\",\"\",VLOOKUP(F79,'9. All Habitats + Multipliers'!$C$4:$K$102,5,FALSE))","v":""},{"$f":"IF(AG79=\"\",\"\",VLOOKUP(AG79,'11. Lists'!$B$47:$D$49,2,FALSE))","v":""},"",{"$f":"IF(AI79=\"\",\"\",VLOOKUP(AI79,'11. Lists'!$F$47:$G$51,2,FALSE))","v":""},{"$nulls":3},"",{"$f":"IF(AN79=\"\",\"\",VLOOKUP(AN79,'11. Lists'!$F$36:$H$38,2,FALSE))","v":""},{"$f":"IF(AN79=\"\",\"\",VLOOKUP(AN79,'11. Lists'!$F$36:$H$38,3,FALSE))","v":""},{"$f":"IF(D79=\"\",\"\",IF(AX79=\"Distinctiveness\",\"N/A\",VLOOKUP(F79,'10. Condition and Temporal'!$B$6:$L$103,11,FALSE)))","v":""},{"$f":"IF(AQ79=\"\",\"\",IF(AQ79=\"N/A\",\"1\",VLOOKUP(AQ79,'11. Lists'!$I$47:$K$80,3,FALSE)))","v":""},{"$f":"IF(D79=\"\",\"\",IF(AX79=\"Condition\",\"N/A\",VLOOKUP(F79,'10. Condition and Temporal'!$B$6:$M$106,12,FALSE)))","v":""},{"$f":"IF(AS79=\"\",\"\",IF(AS79=\"N/A\",\"1\",VLOOKUP(AS79,'11. Lists'!$I$47:$K$80,3,FALSE)))","v":""},{"$f":"IF(D79=\"\",\"\",VLOOKUP(F79,'9. All Habitats + Multipliers'!$C$4:$K$102,8,FALSE))","v":""},{"$f":"IF(AU79=\"\",\"\",VLOOKUP(AU79,'11. Lists'!$J$35:$K$38,2,FALSE))","v":""},{"$f":"IF(D79=\"\",\"\",VLOOKUP(D79,'10. Condition and Temporal'!$B$6:$M$103,4,FALSE))","v":""},"","1","1",14,"","","","","","","","","","","","","","","","","","","","","","BO",{"$f":"BO64","v":0}]
[null,15,"","","",null,null,"","",{"$f":"IF(F80=\"\",\"\",VLOOKUP(F80,'10. Condition and Temporal'!$B$6:$F$103,5,FALSE))","v":""},null,"","",{"$nulls":6},"","","","","",{"$nulls":3},"","","","","",{"$f":"IF(D80=\"\",\"\",VLOOKUP(F80,'9. All Habitats + Multipliers'!$C$4:$K$102,5,FALSE))","v":""},{"$f":"IF(AG80=\"\",\"\",VLOOKUP(AG80,'11. Lists'!$B$47:$D$49,2,FALSE))","v":""},"",{"$f":"IF(AI80=\"\",\"\",VLOOKUP(AI80,'11. Lists'!$F$47:$G$51,2,FALSE))","v":""},{"$nulls":3},"",{"$f":"IF(AN80=\"\",\"\",VLOOKUP(AN80,'11. Lists'!$F$36:$H$38,2,FALSE))","v":""},{"$f":"IF(AN80=\"\",\"\",VLOOKUP(AN80,'11. Lists'!$F$36:$H$38,3,FALSE))","v":""},{"$f":"IF(D80=\"\",\"\",IF(AX80=\"Distinctiveness\",\"N/A\",VLOOKUP(F80,'10. Condition and Temporal'!$B$6:$L$103,11,FALSE)))","v":""},{"$f":"IF(AQ80=\"\",\"\",IF(AQ80=\"N/A\",\"1\",VLOOKUP(AQ80,'11. Lists'!$I$47:$K$80,3,FALSE)))","v":""},{"$f":"IF(D80=\"\",\"\",IF(AX80=\"Condition\",\"N/A\",VLOOKUP(F80,'10. Condition and Temporal'!$B$6:$M$106,12,FALSE)))","v":""},{"$f":"IF(AS80=\"\",\"\",IF(AS80=\"N/A\",\"1\",VLOOKUP(AS80,'11. Lists'!$I$47:$K$80,3,FALSE)))","v":""},{"$f":"IF(D80=\"\",\"\",VLOOKUP(F80,'9. All Habitats + Multipliers'!$C$4:$K$102,8,FALSE))","v":""},{"$f":"IF(AU80=\"\",\"\",VLOOKUP(AU80,'11. Lists'!$J$35:$K$38,2,FALSE))","v":""},{"$f":"IF(D80=\"\",\"\",VLOOKUP(D80,'10. Condition and Temporal'!$B$6:$M$103,4,FALSE))","v":""},"","1","1",15,"","","","","","","","","","","","","","","","","","","","","","BP",{"$f":"BP64","v":0}]
[null,16,"","","",null,null,"","",{"$f":"IF(F81=\"\",\"\",VLOOKUP(F81,'10. Condition and Temporal'!$B$6:$F$103,5,FALSE))","v":""},null,"","",{"$nulls":6},"","","","","",{"$nulls":3},"","","","","",{"$f":"IF(D81=\"\",\"\",VLOOKUP(F81,'9. All Habitats + Multipliers'!$C$4:$K$102,5,FALSE))","v":""},{"$f":"IF(AG81=\"\",\"\",VLOOKUP(AG81,'11. Lists'!$B$47:$D$49,2,FALSE))","v":""},"",{"$f":"IF(AI81=\"\",\"\",VLOOKUP(AI81,'11. Lists'!$F$47:$G$51,2,FALSE))","v":""},{"$nulls":3},"",{"$f":"IF(AN81=\"\",\"\",VLOOKUP(AN81,'11. Lists'!$F$36:$H$38,2,FALSE))","v":""},{"$f":"IF(AN81=\"\",\"\",VLOOKUP(AN81,'11. Lists'!$F$36:$H$38,3,FALSE))","v":""},{"$f":"IF(D81=\"\",\"\",IF(AX81=\"Distinctiveness\",\"N/A\",VLOOKUP(F81,'10. Condition and Temporal'!$B$6:$L$103,11,FALSE)))","v":""},{"$f":"IF(AQ81=\"\",\"\",IF(AQ81=\"N/A\",\"1\",VLOOKUP(AQ81,'11. Lists'!$I$47:$K$80,3,FALSE)))","v":""},{"$f":"IF(D81=\"\",\"\",IF(AX81=\"Condition\",\"N/A\",VLOOKUP(F81,'10. Condition and Temporal'!$B$6:$M$106,12,FALSE)))","v":""},{"$f":"IF(AS81=\"\",\"\",IF(AS81=\"N/A\",\"1\",VLOOKUP(AS81,'11. Lists'!$I$47:$K$80,3,FALSE)))","v":""},{"$f":"IF(D81=\"\",\"\",VLOOKUP(F81,'9. All Habitats + Multipliers'!$C$4:$K$102,8,FALSE))","v":""},{"$f":"IF(AU81=\"\",\"\",VLOOKUP(AU81,'11. Lists'!$J$35:$K$38,2,FALSE))","v":""},{"$f":"IF(D81=\"\",\"\",VLOOKUP(D81,'10. Condition and Temporal'!$B$6:$M$103,4,FALSE))","v":""},"","1","1",16,"","","","","","","","","","","","","","","","","","","","","","BQ",{"$f":"BQ64","v":0}]
[null,17,"","","",null,null,"","",{"$f":"IF(F82=\"\",\"\",VLOOKUP(F82,'10. Condition and Temporal'!$B$6:$F$103,5,FALSE))","v":""},null,"","",{"$nulls":6},"","","","","",{"$nulls":3},"","","","","",{"$f":"IF(D82=\"\",\"\",VLOOKUP(F82,'9. All Habitats + Multipliers'!$C$4:$K$102,5,FALSE))","v":""},{"$f":"IF(AG82=\"\",\"\",VLOOKUP(AG82,'11. Lists'!$B$47:$D$49,2,FALSE))","v":""},"",{"$f":"IF(AI82=\"\",\"\",VLOOKUP(AI82,'11. Lists'!$F$47:$G$51,2,FALSE))","v":""},{"$nulls":3},"",{"$f":"IF(AN82=\"\",\"\",VLOOKUP(AN82,'11. Lists'!$F$36:$H$38,2,FALSE))","v":""},{"$f":"IF(AN82=\"\",\"\",VLOOKUP(AN82,'11. Lists'!$F$36:$H$38,3,FALSE))","v":""},{"$f":"IF(D82=\"\",\"\",IF(AX82=\"Distinctiveness\",\"N/A\",VLOOKUP(F82,'10. Condition and Temporal'!$B$6:$L$103,11,FALSE)))","v":""},{"$f":"IF(AQ82=\"\",\"\",IF(AQ82=\"N/A\",\"1\",VLOOKUP(AQ82,'11. Lists'!$I$47:$K$80,3,FALSE)))","v":""},{"$f":"IF(D82=\"\",\"\",IF(AX82=\"Condition\",\"N/A\",VLOOKUP(F82,'10. Condition and Temporal'!$B$6:$M$106,12,FALSE)))","v":""},{"$f":"IF(AS82=\"\",\"\",IF(AS82=\"N/A\",\"1\",VLOOKUP(AS82,'11. Lists'!$I$47:$K$80,3,FALSE)))","v":""},{"$f":"IF(D82=\"\",\"\",VLOOKUP(F82,'9. All Habitats + Multipliers'!$C$4:$K$102,8,FALSE))","v":""},{"$f":"IF(AU82=\"\",\"\",VLOOKUP(AU82,'11. Lists'!$J$35:$K$38,2,FALSE))","v":""},{"$f":"IF(D82=\"\",\"\",VLOOKUP(D82,'10. Condition and Temporal'!$B$6:$M$103,4,FALSE))","v":""},"","1","1",17,"","","","","","","","","","","","","","","","","","","","","","BR",{"$f":"BR64","v":0}]
[null,18,"","","",null,null,"","",{"$f":"IF(F83=\"\",\"\",VLOOKUP(F83,'10. Condition and Temporal'!$B$6:$F$103,5,FALSE))","v":""},null,"","",{"$nulls":6},"","","","","",{"$nulls":3},"","","","","",{"$f":"IF(D83=\"\",\"\",VLOOKUP(F83,'9. All Habitats + Multipliers'!$C$4:$K$102,5,FALSE))","v":""},{"$f":"IF(AG83=\"\",\"\",VLOOKUP(AG83,'11. Lists'!$B$47:$D$49,2,FALSE))","v":""},"",{"$f":"IF(AI83=\"\",\"\",VLOOKUP(AI83,'11. Lists'!$F$47:$G$51,2,FALSE))","v":""},{"$nulls":3},"",{"$f":"IF(AN83=\"\",\"\",VLOOKUP(AN83,'11. Lists'!$F$36:$H$38,2,FALSE))","v":""},{"$f":"IF(AN83=\"\",\"\",VLOOKUP(AN83,'11. Lists'!$F$36:$H$38,3,FALSE))","v":""},{"$f":"IF(D83=\"\",\"\",IF(AX83=\"Distinctiveness\",\"N/A\",VLOOKUP(F83,'10. Condition and Temporal'!$B$6:$L$103,11,FALSE)))","v":""},{"$f":"IF(AQ83=\"\",\"\",IF(AQ83=\"N/A\",\"1\",VLOOKUP(AQ83,'11. Lists'!$I$47:$K$80,3,FALSE)))","v":""},{"$f":"IF(D83=\"\",\"\",IF(AX83=\"Condition\",\"N/A\",VLOOKUP(F83,'10. Condition and Temporal'!$B$6:$M$106,12,FALSE)))","v":""},{"$f":"IF(AS83=\"\",\"\",IF(AS83=\"N/A\",\"1\",VLOOKUP(AS83,'11. Lists'!$I$47:$K$80,3,FALSE)))","v":""},{"$f":"IF(D83=\"\",\"\",VLOOKUP(F83,'9. All Habitats + Multipliers'!$C$4:$K$102,8,FALSE))","v":""},{"$f":"IF(AU83=\"\",\"\",VLOOKUP(AU83,'11. Lists'!$J$35:$K$38,2,FALSE))","v":""},{"$f":"IF(D83=\"\",\"\",VLOOKUP(D83,'10. Condition and Temporal'!$B$6:$M$103,4,FALSE))","v":""},"","1","1",18,"","","","","","","","","","","","","","","","","","","","","","BS",{"$f":"BS64","v":0}]
[null,19,"","","",null,null,"","",{"$f":"IF(F84=\"\",\"\",VLOOKUP(F84,'10. Condition and Temporal'!$B$6:$F$103,5,FALSE))","v":""},null,"","",{"$nulls":6},"","","","","",{"$nulls":3},"","","","","",{"$f":"IF(D84=\"\",\"\",VLOOKUP(F84,'9. All Habitats + Multipliers'!$C$4:$K$102,5,FALSE))","v":""},{"$f":"IF(AG84=\"\",\"\",VLOOKUP(AG84,'11. Lists'!$B$47:$D$49,2,FALSE))","v":""},"",{"$f":"IF(AI84=\"\",\"\",VLOOKUP(AI84,'11. Lists'!$F$47:$G$51,2,FALSE))","v":""},{"$nulls":3},"",{"$f":"IF(AN84=\"\",\"\",VLOOKUP(AN84,'11. Lists'!$F$36:$H$38,2,FALSE))","v":""},{"$f":"IF(AN84=\"\",\"\",VLOOKUP(AN84,'11. Lists'!$F$36:$H$38,3,FALSE))","v":""},{"$f":"IF(D84=\"\",\"\",IF(AX84=\"Distinctiveness\",\"N/A\",VLOOKUP(F84,'10. Condition and Temporal'!$B$6:$L$103,11,FALSE)))","v":""},{"$f":"IF(AQ84=\"\",\"\",IF(AQ84=\"N/A\",\"1\",VLOOKUP(AQ84,'11. Lists'!$I$47:$K$80,3,FALSE)))","v":""},{"$f":"IF(D84=\"\",\"\",IF(AX84=\"Condition\",\"N/A\",VLOOKUP(F84,'10. Condition and Temporal'!$B$6:$M$106,12,FALSE)))","v":""},{"$f":"IF(AS84=\"\",\"\",IF(AS84=\"N/A\",\"1\",VLOOKUP(AS84,'11. Lists'!$I$47:$K$80,3,FALSE)))","v":""},{"$f":"IF(D84=\"\",\"\",VLOOKUP(F84,'9. All Habitats + Multipliers'!$C$4:$K$102,8,FALSE))","v":""},{"$f":"IF(AU84=\"\",\"\",VLOOKUP(AU84,'11. Lists'!$J$35:$K$38,2,FALSE))","v":""},{"$f":"IF(D84=\"\",\"\",VLOOKUP(D84,'10. Condition and Temporal'!$B$6:$M$103,4,FALSE))","v":""},"","1","1",19,"","","","","","","","","","","","","","","","","","","","","","BT",{"$f":"BT64","v":0}]
[null,20,"","","",null,null,"","",{"$f":"IF(F85=\"\",\"\",VLOOKUP(F85,'10. Condition and Temporal'!$B$6:$F$103,5,FALSE))","v":""},null,"","",{"$nulls":6},"","","","","",{"$nulls":3},"","","","","",{"$f":"IF(D85=\"\",\"\",VLOOKUP(F85,'9. All Habitats + Multipliers'!$C$4:$K$102,5,FALSE))","v":""},{"$f":"IF(AG85=\"\",\"\",VLOOKUP(AG85,'11. Lists'!$B$47:$D$49,2,FALSE))","v":""},"",{"$f":"IF(AI85=\"\",\"\",VLOOKUP(AI85,'11. Lists'!$F$47:$G$51,2,FALSE))","v":""},{"$nulls":3},"",{"$f":"IF(AN85=\"\",\"\",VLOOKUP(AN85,'11. Lists'!$F$36:$H$38,2,FALSE))","v":""},{"$f":"IF(AN85=\"\",\"\",VLOOKUP(AN85,'11. Lists'!$F$36:$H$38,3,FALSE))","v":""},{"$f":"IF(D85=\"\",\"\",IF(AX85=\"Distinctiveness\",\"N/A\",VLOOKUP(F85,'10. Condition and Temporal'!$B$6:$L$103,11,FALSE)))","v":""},{"$f":"IF(AQ85=\"\",\"\",IF(AQ85=\"N/A\",\"1\",VLOOKUP(AQ85,'11. Lists'!$I$47:$K$80,3,FALSE)))","v":""},{"$f":"IF(D85=\"\",\"\",IF(AX85=\"Condition\",\"N/A\",VLOOKUP(F85,'10. Condition and Temporal'!$B$6:$M$106,12,FALSE)))","v":""},{"$f":"IF(AS85=\"\",\"\",IF(AS85=\"N/A\",\"1\",VLOOKUP(AS85,'11. Lists'!$I$47:$K$80,3,FALSE)))","v":""},{"$f":"IF(D85=\"\",\"\",VLOOKUP(F85,'9. All Habitats + Multipliers'!$C$4:$K$102,8,FALSE))","v":""},{"$f":"IF(AU85=\"\",\"\",VLOOKUP(AU85,'11. Lists'!$J$35:$K$38,2,FALSE))","v":""},{"$f":"IF(D85=\"\",\"\",VLOOKUP(D85,'10. Condition and Temporal'!$B$6:$M$103,4,FALSE))","v":""},"","1","1",20,"","","","","","","","","","","","","","","","","","","","","","BU",{"$f":"BU64","v":0}]
[{"$nulls":7},"Totals",{"$f":"SUM(I66:I85)","v":{"v":0,"d":"0.00"}},null,null,{"$f":"SUM(L66:L85)","v":{"v":0,"d":"0.0000"}},{"$f":"SUM(M66:N85)","v":{"v":0,"d":"0.0000"}}]
[]
[]
[]
[]
["Data beyond this row is automated"]
[]
[]
[]
[null,null,"1e . Trading Summary"]
[]
[null,null,"Distinctiveness and Habitat Type",null,{"$f":"IF(OR(I103:I106=\"No ▲\"),\"Error - Trading Rules Not Satisfied ▲\",\"Trading Rules Satisfied ✓\")","v":"Trading Rules Satisfied ✓"},{"$nulls":4},{"$f":"IFERROR(FIND(\"Error\",E97),0)","v":0}]
[]
[null,null,"1f . Habitat trading assessment"]
[]
[]
[null,null,"Broad habitat type","Distinctiveness","Habitat Type","Baseline units","Onsite provision","Net change","Trading satisfied?"]
[null,null,"Watercourses","Medium distinctiveness","Canals",{"$f":"SUMIF($D$11:$E$30, $E$103, $L$11:$L$30)","v":{"v":0,"d":"0.0000"}},{"$f":"IF($I$59+$I$86+$P$1=0,0,SUMIF($D$39:$D$58,$E$103,$L$39:$N$58)+SUMIF($F$66:$G$85,$E$103,$L$66:$L$85)+SUMIF($D$11:$E$30,$E$103,$AE$11:$AE$30))","v":{"v":0,"d":"0.0000"}},{"$f":"$G$103-$F$103","v":{"v":0,"d":"0.0000"}},{"$f":"IF(AND($H$103>=0, H104>=0),\"Yes ✓\", \"No ▲\")","v":"Yes ✓"}]
[{"$nulls":4},"Ditches",{"$f":"SUMIF($D$11:$E$30,$E$104,$L$11:$L$30)","v":{"v":0,"d":"0.0000"}},{"$f":"IF($I$59+$I$86+$P$1=0,0,SUMIF($D$39:$D$58,$E$104,$L$39:$N$58)+SUMIF($F$66:$G$85,$E$104,$L$66:$L$85)+SUMIF($D$11:$E$30,$E$104,$AE$11:$AE$30))","v":{"v":0,"d":"0.0000"}},{"$f":"$G$104-$F$104","v":{"v":0,"d":"0.0000"}}]
[{"$nulls":4},"Sum",{"$f":"SUM(F103:F104)","v":{"v":0,"d":"0.0000"}},{"$f":"SUM(G103:G104)","v":{"v":0,"d":"0.0000"}},{"$f":"SUM($H$103:$H$104)","v":{"v":0,"d":"0.0000"}},null,{"$f":"IF($I$103= \"No ▲\",1,0)","v":0}]
[{"$nulls":3},"Low distinctiveness","Culvert",{"$f":"SUMIF($D$11:$E$30,$E$106,$L$11:$L$30)","v":{"v":0,"d":"0.0000"}},{"$f":"IF($I$59+$I$86+$P$1=0,0,SUMIF($D$39:$D$58,$E$106,$L$39:$N$58)+SUMIF($F$66:$G$85,$E$106,$L$66:$L$85)+SUMIF($D$11:$E$30,$E$106,$AE$11:$AE$30))","v":{"v":0,"d":"0.0000"}},{"$f":"$G$106-$F$106","v":{"v":0,"d":"0.0000"}},{"$f":"IF($G$107>=0,\"Yes ✓\", \"No ▲\")","v":"Yes ✓"},{"$f":"IF($I$106= \"No ▲\",1,0)","v":0}]
[{"$nulls":6},{"$f":"IF(H105>0,($H$105+$H$106),H106)","v":0}]
[null,null,"Surplus medium distinctiveness units to offset low distinctiveness units",{"$nulls":3},{"$f":"$H$105","v":{"v":0,"d":"0.0000"}}]
[null,null,"Surplus watercourse biodiversity units",{"$nulls":3},{"$f":"IF($H$105<=0,$H$106,($H$106+$H$105))","v":{"v":0,"d":"0.0000"}}]

{"sheet":"8. Headline Results","index":7,"n_rows":65,"n_cols":6,"rows_kept":65,"merged":[[1,1,1,2],[1,3,1,4],[2,1,2,2],[2,3,2,4],[2,7,2,14],[4,1,4,2],[4,3,4,4],[6,1,6,2],[6,3,6,4],[8,1,8,2],[8,3,8,4],[9,3,9,4],[10,1,12,1],[14,1,16,1],[18,1,20,1],[22,1,24,1],[26,1,26,2],[26,3,26,4],[27,1,27,2],[27,3,27,4],[28,1,28,2],[28,3,28,4],[64,1,65,1],[66,1,67,1]]}
[]
[null,"Site Name",null,{"$f":"IF('2. Site Details'!D4=\"\",\"Enter site name on 2. Site Details\",'2. Site Details'!D4)","v":" 'Glenside' 45 Windmill Lane, Alton, Hampshire GU34 2SN"}]
[null,"Sheet Name",null,"Headline Results"]
[null,"Headline Results"]
[null,"Headline",null,{"$f":"IF(OR(D27>0,D28>0,D29>0),\"BNG Targets Not Met ▲\",\"BNG Targets Met ✓\")","v":"BNG Targets Not Met ▲"}]
[]
[null,"Trading Rules",null,{"$f":"IF('5. Area Habitats'!J108+'5. Area Habitats'!J109+'6. Hedges & Lines of Trees'!J97+'7. Watercourses'!J97>0,\"Trading Rules Not Satisfied ▲\",\"Trading Rules Satisfied ✓\")","v":"Trading Rules Not Satisfied ▲"}]
[]
[null,"Next steps",null,{"$f":"IF(OR(D5=\"BNG Targets Not Met ▲\",D7=\"Trading Rules Not Satisfied ▲\"),\"Scheme alterations or offsite units required\",\"Check for input errors/rule breaks present in the metric ⚠\")","v":"Scheme alterations or offsite units required"}]
[{"$nulls":5},"% unit change required"]
[null,"Baseline Units","Area habitat units",{"$f":"IF('5. Area Habitats'!L32=0,\"Zero Units Baseline\",'5. Area Habitats'!L32)","v":{"v":0.27363308799999997,"d":"0.2736"}},null,{"$f":"('2. Site Details'!$D$13/100)*$D$11","v":0.0273633088}]
[null,null,"Hedgerow units",{"$f":"IF('6. Hedges & Lines of Trees'!L31=0,\"Zero Units Baseline\",'6. Hedges & Lines of Trees'!L31)","v":"Zero Units Baseline"},null,{"$f":"('2. Site Details'!$D$14/100)*$D$12","v":{"$error":"#VALUE!"}}]
[null,null,"Watercourse units",{"$f":"IF('7. Watercourses'!L31=0,\"Zero Units Baseline\",'7. Watercourses'!L31)","v":"Zero Units Baseline"},null,{"$f":"('2. Site Details'!$D$15/100)*$D$13","v":{"$error":"#VALUE!"}}]
[{"$nulls":5},"Target units required (baseline plus extra units needed)"]
[null,"Post-development Units","Area habitat units",{"$f":"'5. Area Habitats'!P3+'5. Area Habitats'!P4+'5. Area Habitats'!P1","v":{"v":0.24188782497959577,"d":"0.2419"}},null,{"$f":"D11+F11","v":{"v":0.30099639679999995,"d":"0.3010"}}]
[null,null,"Hedgerow units",{"$f":"'6. Hedges & Lines of Trees'!P3+'6. Hedges & Lines of Trees'!P4+'6. Hedges & Lines of Trees'!P1","v":{"v":0.05086538813460001,"d":"0.0509"}},null,{"$f":"D12+F12","v":{"$error":"#VALUE!"}}]
[null,null,"Watercourse units",{"$f":"'7. Watercourses'!P3+'7. Watercourses'!P4+'7. Watercourses'!P1","v":{"v":0,"d":"0.0000"}},null,{"$f":"D13+F13","v":{"$error":"#VALUE!"}}]
[]
[null,"Total net unit change","Area habitat units",{"$f":"'5. Area Habitats'!P5","v":{"v":-0.0317452630204042,"d":"-0.0317"}},{"$f":"_xlfn.IFS(D19>=F11,\"✓\",D19<0,\"▲\", D19<F11,\"⚠\")","v":{"$error":"#NAME?"}},{"$f":"F11/D11","v":{"v":0.1,"d":"10.00%"}}]
[null,null,"Hedgerow units",{"$f":"'6. Hedges & Lines of Trees'!P5","v":{"v":0.05086538813460001,"d":"0.0509"}},{"$f":"_xlfn.IFS(D20>=F12,\"✓\",D20<0,\"▲\", D20<F12,\"⚠\")","v":{"$error":"#NAME?"}},{"$f":"F12/D12","v":{"$error":"#VALUE!"}}]
[null,null,"Watercourse units",{"$f":"'7. Watercourses'!P5","v":{"v":0,"d":"0.0000"}},{"$f":"_xlfn.IFS(D21>=F13,\"✓\",D21<0,\"▲\", D21<F13,\"⚠\")","v":{"$error":"#VALUE!"}},{"$error":"#VALUE!"}]
[]
[null,"Total net % change","Area habitat units",{"$f":"IF(D11=\"Zero Units Baseline\",\"% target not appropriate\",D19/D11)","v":{"v":-0.11601397788707558,"d":"-11.60%"}},{"$f":"_xlfn.IFS(D23>=F19,\"✓\",D23<0,\"▲\", D23<F19,\"⚠\")","v":{"$error":"#NAME?"}},{"$f":"$D$23*100","v":-11.601397788707558}]
[null,null,"Hedgerow units",{"$f":"IF(D12=\"Zero Units Baseline\",\"% target not appropriate\",D20/D12)","v":"% target not appropriate"},{"$f":"_xlfn.IFS(D24>=F20,\"✓\",D24<0,\"▲\", D24<F20,\"⚠\")","v":{"$error":"#NAME?"}},{"$f":"$D$24*100","v":{"$error":"#VALUE!"}}]
[null,null,"Watercourse units",{"$f":"IF(D13=\"Zero Units Baseline\",\"% target not appropriate\",D21/D13)","v":"% target not appropriate"},{"$f":"_xlfn.IFS(D25>=F21,\"✓\",D25<0,\"▲\", D25<F21,\"⚠\")","v":{"$error":"#VALUE!"}},{"$f":"$D$25*100","v":{"$error":"#VALUE!"}}]
[]
[null,"Area habitat units required to meet target",null,{"$f":"IFERROR(IF(D11=\"Zero Units Baseline\",IF('2. Site Details'!D17<=D15,0,'2. Site Details'!D17-D15),(IF((D11*(1+('2. Site Details'!D13/100)))-D15<0,0,F15-D15))),\"\")","v":{"v":0.05910857182040419,"d":"0.0591"}}]
[null,"Hedgerow units required to meet target",null,{"$f":"IFERROR(IF(D12=\"Zero Units Baseline\",IF('2. Site Details'!D18<=D16,0,'2. Site Details'!D18-D16),(IF((D12*(1+('2. Site Details'!D14/100)))-D16<0,0,F16-D16))),\"\")","v":{"v":0,"d":"0.0000"}}]
[null,"Watercourse units required to meet target",null,{"$f":"IFERROR(IF(D13=\"Zero Units Baseline\",IF('2. Site Details'!D19<=D17,0,'2. Site Details'!D19-D17),(IF((D13*(1+('2. Site Details'!D15/100)))-D17<0,0,F17-D17))),\"\")","v":{"v":0,"d":"0.0000"}}]
[]
[]
[]
[null,"Chart 1 - Unit change by habitat group"]
[]
[null,null,"Baseline","Provision"]
[null,"Habitat units",{"$f":"IF(D11=\"Zero Units Baseline\",0,D11)","v":{"v":0.27363308799999997,"d":"0.27"}},{"$f":"D15","v":{"v":0.24188782497959577,"d":"0.24"}}]
[null,"Hedgerow units",{"$f":"IF(D12=\"Zero Units Baseline\",0,D12)","v":{"v":0,"d":"0.00"}},{"$f":"D16","v":{"v":0.05086538813460001,"d":"0.05"}}]
[null,"River units",{"v":0,"d":"0.00"},{"v":0,"d":"0.00"}]
{"$rows_empty":26}
[null,"* based on government cost per unit of:",{"v":26000,"d":"£26,000"}]

{"sheet":"9. All Habitats + Multipliers","index":8,"n_rows":102,"n_cols":11,"rows_kept":102,"merged":[[0,1,0,9],[1,1,2,1],[1,2,1,5],[1,6,1,7],[1,8,1,9]]}
[null,"9. All Habitats + Multipliers - (general technical information for reference purposes only)",{"$nulls":8},9]
[null,"Ref","Habitat Type",{"$nulls":3},"Distinctiveness",null,"Risk Multipliers",null,"Location Multipliers"]
[null,null,"Habitat Type","Broad Habitat Group","Nearest Ukhab Habitat","Definitive Ukhab /  Unis Code","Distinctiveness Category ","Trading Notes","Technical Difficulty Creation","Technical Difficulty Enhancement","Connectivity"]
[null,1,"Arable field margins cultivated annually","Cropland",null,null,"Medium","Same broad habitat or a higher distinctiveness habitat required","Low","Low","Low"]
[null,2,"Arable field margins game bird mix","Cropland",null,null,"Medium","Same broad habitat or a higher distinctiveness habitat required","Low","Low","Low"]
[null,3,"Arable field margins pollen and nectar","Cropland",null,null,"Medium","Same broad habitat or a higher distinctiveness habitat required","Low","Low","Low"]
[null,4,"Arable field margins tussocky","Cropland",null,null,"Medium","Same broad habitat or a higher distinctiveness habitat required","Low","Low","Low"]
[null,5,"Cereal crops","Cropland",null,null,"Low","Same distinctiveness or better habitat required","Low","Low","Low"]
[null,{"$f":"B8+1","v":6},"Winter stubble","Cropland",null,null,"Low","Same distinctiveness or better habitat required","Low","Low","Low"]
[null,{"$f":"B9+1","v":7},"Horticulture","Cropland",null,null,"Low","Same distinctiveness or better habitat required","Low","Low","Low"]
[null,8,"Intensive orchards","Cropland",null,null,"Low","Same distinctiveness or better habitat required","Low","Low","Low"]
[null,9,"Non-cereal crops","Cropland",null,null,"Low","Same distinctiveness or better habitat required","Low","Low","Low"]
[null,10,"Temporary grass and clover leys","Cropland",null,null,"Low","Same distinctiveness or better habitat required","Low","Low","Low"]
[null,11,"Bracken","Grassland",null,null,"Low","Same distinctiveness or better habitat required","Low","Low","Low"]
[null,12,"Modified grassland","Grassland",null,null,"Low","Same distinctiveness or better habitat required","Low","Low","Low"]
[null,13,"Other lowland acid grassland","Grassland",null,null,"Medium","Same broad habitat or a higher distinctiveness habitat required","Low","Low","Low"]
[null,14,"Other neutral grassland","Grassland",null,null,"Medium","Same broad habitat or a higher distinctiveness habitat required","Low","Low","Low"]
[null,15,"Upland acid grassland","Grassland",null,null,"Medium","Same broad habitat or a higher distinctiveness habitat required","Low","Low","Low"]
[null,16,"Blackthorn scrub","Heathland and shrub",null,null,"Medium","Same broad habitat or a higher distinctiveness habitat required","Low","Low","Low"]
[null,17,"Bramble scrub","Heathland and shrub",null,null,"Medium","Same broad habitat or a higher distinctiveness habitat required","Low","Low","Low"]
[null,18,"Gorse scrub","Heathland and shrub",null,null,"Medium","Same broad habitat or a higher distinctiveness habitat required","Low","Low","Low"]
[null,19,"Hawthorn scrub","Heathland and shrub",null,null,"Medium","Same broad habitat or a higher distinctiveness habitat required","Low","Low","Low"]
[null,20,"Hazel scrub","Heathland and shrub",null,null,"Medium","Same broad habitat or a higher distinctiveness habitat required","Medium","Low","Low"]
[null,21,"Mixed scrub","Heathland and shrub",null,null,"Medium","Same broad habitat or a higher distinctiveness habitat required","Low","Low","Low"]
[null,22,"Rhododendron scrub","Heathland and shrub",null,null,"Low","Same distinctiveness or better habitat required","Low","Low","Low"]
[null,{"$f":"B25+1","v":23},"Other sea buckthorn scrub","Heathland and shrub",null,null,"Low","Same distinctiveness or better habitat required","Low","Low","Low"]
[null,{"$f":"B26+1","v":24},"Willow scrub","Heathland and shrub",null,null,"Medium","Same broad habitat or a higher distinctiveness habitat required","Medium","Low"]
[null,{"$f":"B27+1","v":25},"Ornamental lake or pond","Lakes",null,null,"Low","Same distinctiveness or better habitat required","Low","High","Low"]
[null,26,"Ponds (non-priority habitat)","Lakes",null,null,"Medium","Same broad habitat or a higher distinctiveness habitat required","Low","Medium","Low"]
[null,27,"Reservoirs","Lakes",null,null,"Medium","Same broad habitat or a higher distinctiveness habitat required","Medium","Medium","Low"]
[null,28,"Ruderal/Ephemeral","Sparsely vegetated land",null,null,"Low","Same distinctiveness or better habitat required","Low","Medium","Low"]
[null,29,"Other inland rock and scree","Sparsely vegetated land",null,null,"Medium","Same broad habitat or a higher distinctiveness habitat required","Medium","Medium","Low"]
[null,30,"Tall forbs","Sparsely vegetated land",null,null,"Low","Same distinctiveness or better habitat required","Low","Medium"]
[null,{"$f":"B33+1","v":31},"Allotments","Urban",null,null,"Low","Same distinctiveness or better habitat required","Low","Low","Low"]
[null,32,"Artificial unvegetated, unsealed surface","Urban",null,null,"V.Low","Compensation Not Required","Low","Low","Low"]
[null,33,"Bioswale","Urban",null,null,"Low","Same distinctiveness or better habitat required","Medium","Low","Low"]
[null,34,"Biodiverse green roof","Urban",null,null,"Medium","Same broad habitat or a higher distinctiveness habitat required","Medium","Medium","Low"]
[null,35,"Built linear features","Urban",null,null,"V.Low","Compensation Not Required","Low","Low","Low"]
[null,36,"Cemeteries and churchyards","Urban",null,null,"Medium","Same broad habitat or a higher distinctiveness habitat required","Medium","Low","Low"]
[null,37,"Developed land; sealed surface","Urban",null,null,"V.Low","Compensation Not Required","Low","Low","Low"]
[null,38,"Intensive green roof","Urban",null,null,"Low","Same distinctiveness or better habitat required","Low","Low","Low"]
[null,39,"Facade-bound green wall","Urban",null,null,"Low","Same distinctiveness or better habitat required","Medium","Medium","Low"]
[null,40,"Ground based green wall","Urban",null,null,"Low","Same distinctiveness or better habitat required","Medium","Medium","Low"]
[null,41,"Ground level planters","Urban",null,null,"Low","Same distinctiveness or better habitat required","Low","Low","Low"]
[null,42,"Other green roof","Urban",null,null,"Low","Same distinctiveness or better habitat required","Low","Low","Low"]
[null,43,"Introduced shrub","Urban",null,null,"Low","Same distinctiveness or better habitat required","Low","Low","Low"]
[null,44,"Rain garden","Urban",null,null,"Low","Same distinctiveness or better habitat required","Low","Low","Low"]
[null,45,"Actively worked sand pit quarry or open cast mine","Urban",null,null,"Low","Same distinctiveness or better habitat required","Medium","Low","Low"]
[null,46,"Urban/rural tree","Individual trees",null,null,"Medium","Same broad habitat or a higher distinctiveness habitat required","Low","Low","Low"]
[null,47,"Sustainable drainage system","Urban",null,null,"Low","Same distinctiveness or better habitat required","Medium","Medium","Low"]
[null,48,"Unvegetated garden","Urban",null,null,"V.Low","Compensation Not Required","Low","Low","Low"]
[null,49,"Vacant or derelict land","Urban",null,null,"Low","Same distinctiveness or better habitat required","Low","Low","Low"]
[null,50,"Vegetated garden","Urban",null,null,"Low","Same distinctiveness or better habitat required","Low","Low","Low"]
[null,51,"Bare ground","Urban",null,null,"Low","Same distinctiveness or better habitat required","Low","Low"]
[null,{"$f":"B54+1","v":52},"Other coniferous woodland","Woodland and forest",null,null,"Low","Same distinctiveness or better habitat required","Low","Low","Low"]
[null,53,"Other Scot's pine woodland","Woodland and forest",null,null,"Medium","Same broad habitat or a higher distinctiveness habitat required","Medium","Medium","Low"]
[null,54,"Other woodland; broadleaved","Woodland and forest",null,null,"Medium","Same broad habitat or a higher distinctiveness habitat required","Low","Low","Low"]
[null,55,"Other woodland; mixed","Woodland and forest",null,null,"Medium","Same broad habitat or a higher distinctiveness habitat required","Low","Low","Low"]
[null,56,"Littoral coarse sediment","Intertidal sediment",null,null,"Medium","Same broad habitat or a higher distinctiveness habitat required","Medium","Medium","Low"]
[null,57,"Artificial saltmarshes and saline reedbeds","Coastal saltmarsh",null,null,"Low","Same distinctiveness or better habitat required","High","Medium","Low"]
[null,58,"Artificial littoral coarse sediment","Intertidal sediment",null,null,"Low","Same distinctiveness or better habitat required","Medium","Medium","Low"]
[null,59,"Artificial littoral mud","Intertidal sediment",null,null,"Low","Same distinctiveness or better habitat required","High","Medium","Low"]
[null,60,"Artificial littoral sand","Intertidal sediment",null,null,"Low","Same distinctiveness or better habitat required","Medium","Medium","Low"]
[null,61,"Artificial littoral muddy sand","Intertidal sediment",null,null,"Low","Same distinctiveness or better habitat required","High","Medium","Low"]
[null,62,"Artificial littoral mixed sediments","Intertidal sediment",null,null,"Low","Same distinctiveness or better habitat required","High","Medium","Low"]
[null,63,"Artificial littoral seagrass","Intertidal sediment",null,null,"Low","Same distinctiveness or better habitat required","High","High","Low"]
[null,64,"Artificial littoral biogenic reefs","Intertidal sediment",null,null,"Low","Same distinctiveness or better habitat required","High","Medium","Low"]
[null,65,"Littoral sand","Intertidal sediment",null,null,"Medium","Same broad habitat or a higher distinctiveness habitat required","Medium","Medium","Low"]
[null,66,"Artificial hard structures","Intertidal hard structures",null,null,"Low","Same distinctiveness or better habitat required","Medium","Medium","Low"]
[null,67,"Artificial features of hard structures","Intertidal hard structures",null,null,"Low","Same distinctiveness or better habitat required","Medium","Medium","Low"]
[null,68,"Artificial hard structures with integrated greening of grey infrastructure (IGGI)","Intertidal hard structures",null,null,"Medium","Same broad habitat or a higher distinctiveness habitat required","Medium","Medium","Low"]
[null,69,"Species-rich native hedgerow","Hedgerows and Lines of trees",null,null,"Medium","Same distinctiveness or better habitat required","Low","Low","Low"]
[null,70,"Native hedgerow - associated with bank or ditch","Hedgerows and Lines of trees",null,null,"Medium","Same distinctiveness or better habitat required","Low","Low","Low"]
[null,71,"Native hedgerow with trees","Hedgerows and Lines of trees",null,null,"Medium","Same distinctiveness or better habitat required","Low","Low","Low"]
[null,72,"Native hedgerow","Hedgerows and Lines of trees",null,null,"Low","Same distinctiveness or better habitat required","Low","Low","Low"]
[null,73,"Non-native and ornamental hedgerow","Hedgerows and Lines of trees",null,null,"V.Low","Compensation Not Required","Low","Low","Low"]
[null,{"$f":"B76+1","v":74},"Line of trees","Hedgerows and Lines of trees",null,null,"Low","Same distinctiveness or better habitat required","Low","Low","Low"]
[null,75,"Ecologically valuable line of trees","Hedgerows and Lines of trees",null,null,"Medium","Same distinctiveness or better habitat required","Low","Low","Low"]
[null,76,"Line of trees - associated with bank or ditch","Hedgerows and Lines of trees",null,null,"Low","Same distinctiveness or better habitat required","Low","Low","Low"]
[null,77,"Ecologically valuable line of trees - associated with bank or ditch","Hedgerows and Lines of trees",null,null,"Medium","Same distinctiveness or better habitat required","Low","Low","Low"]
[null,78,"Ditches","Rivers",null,null,"Medium","Same habitat required","Medium","Low","Low"]
[null,79,"Canals","Rivers",null,null,"Medium","Same habitat required","Medium","Low","Low"]
[null,80,"Culvert","Rivers",null,null,"Low","Better distinctiveness habitat required","Medium","N/A","Low"]
[null,81,{"$nulls":8},"Low"]
[null,82]
[null,83]
[null,84]
[null,85]
[null,86]
[null,87]
[null,88]
[null,89]
[null,90]
[null,91]
[null,92]
[null,93]
[null,94]
[null,95]
[null,96]
[null,97]
[null,98]
[null,99]

{"sheet":"10. Condition and Temporal","index":9,"n_rows":85,"n_cols":14,"rows_kept":85,"merged":[[0,1,1,13],[2,1,4,1],[2,2,2,5],[2,6,2,12],[2,13,4,13],[3,2,4,2],[3,3,4,3],[3,4,4,4],[3,5,4,5],[3,11,4,11],[3,12,4,12]]}
[null,"10. Condition and Temporal - general technical information for refence purposes only)"]
[]
[null,"Habitat Type","Condition",{"$nulls":3},"Temporal Multipliers",{"$nulls":6},"Enhancement Rules"]
[null,null,"Baseline Default Condition","Creation Condition Options","Enhancement Habitat options","EnhancementDefault Condition","Years To Target Condition Creation - Moderate","Years To Target Condition Creation - Good","Years To Target Condition Creation - Poor","Years To Target Condition Creation - Condition assessment N/A","Years To Target Condition Creation - N/A Other","Time To Target Condition Enhancement - Moderate to Good","Time To Target Distinctiveness Enhancement - Low to Default Condition"]
[{"$nulls":6},"Moderate","Good","Poor","Condition Assessment N/A","N/A - Other"]
[null,"Arable field margins cultivated annually","Condition Assessment N/A","Condition Assessment N/A","Enhancement not possible","Condition Assessment N/A","Not Possible","Not Possible","Not Possible",1,"Not Possible","Not Possible",1,"Enhancement not possible"]
[null,"Arable field margins game bird mix","Condition Assessment N/A","Condition Assessment N/A","Enhancement not possible","Condition Assessment N/A","Not Possible","Not Possible","Not Possible",1,"Not Possible","Not Possible",1,"Enhancement not possible"]
[null,"Arable field margins pollen and nectar","Condition Assessment N/A","Condition Assessment N/A","Enhancement not possible","Condition Assessment N/A","Not Possible","Not Possible","Not Possible",1,"Not Possible","Not Possible",1,"Enhancement not possible"]
[null,"Arable field margins tussocky","Condition Assessment N/A","Condition Assessment N/A","Enhancement not possible","Condition Assessment N/A","Not Possible","Not Possible","Not Possible",1,"Not Possible","Not Possible",1,"Enhancement not possible"]
[null,"Cereal crops","Condition Assessment N/A","Condition Assessment N/A","Arable field margins cultivated annually, Arable field margins game bird mix, Arable field margins pollen and nectar, Arable field margins tussocky","Not Possible","Not Possible","Not Possible","Not Possible",1,"Not Possible","Not Possible","Not Possible","Condition enhancement not possible, enhancement to any medium distinctiveness cropland habitat only"]
[null,"Winter stubble","Condition Assessment N/A","Condition Assessment N/A","Enhancement not possible","Condition Assessment N/A","Not Possible","Not Possible","Not Possible",1,"Not Possible","Not Possible","Not Possible","Enhancement not possible"]
[null,"Horticulture","Condition Assessment N/A","Condition Assessment N/A","Arable field margins cultivated annually, Arable field margins game bird mix, Arable field margins pollen and nectar, Arable field margins tussocky","Not Possible","Not Possible","Not Possible","Not Possible",1,"Not Possible","Not Possible","Not Possible","Condition enhancement not possible, enhancement to any medium distinctiveness cropland habitat only"]
[null,"Intensive orchards","Condition Assessment N/A","Condition Assessment N/A","Arable field margins cultivated annually, Arable field margins game bird mix, Arable field margins pollen and nectar, Arable field margins tussocky","Not Possible","Not Possible","Not Possible","Not Possible",1,"Not Possible","Not Possible","Not Possible","Condition enhancement not possible, enhancement to any medium distinctiveness cropland habitat only"]
[null,"Non-cereal crops","Condition Assessment N/A","Condition Assessment N/A","Arable field margins cultivated annually, Arable field margins game bird mix, Arable field margins pollen and nectar, Arable field margins tussocky","Not Possible","Not Possible","Not Possible","Not Possible",1,"Not Possible","Not Possible","Not Possible","Condition enhancement not possible, enhancement to any medium distinctiveness cropland habitat only"]
[null,"Temporary grass and clover leys","Condition Assessment N/A","Condition Assessment N/A","Other lowland acid grassland, Other neutral grassland, Upland acid grassland","Not Possible","Not Possible","Not Possible","Not Possible",1,"Not Possible","Not Possible","Not Possible","Condition enhancement not possible, enhancement to any medium distinctiveness grassland habitat only"]
[null,"Bracken","Condition Assessment N/A","Condition Assessment N/A","Other lowland acid grassland, Other neutral grassland, Upland acid grassland","Not Possible","Not Possible","Not Possible","Not Possible",1,"Not Possible","Not Possible","Not Possible","Condition enhancement not possible, enhancement to any medium distinctiveness grassland habitat only"]
[null,"Modified grassland","Moderate","Moderate, Good","Modified grassland, Other lowland acid grassland, Other neutral grassland, Upland acid grassland","Good",4,7,"Not Possible","Not Possible","Not Possible",10,15,"Condition enhancement or enhancement to any medium distinctiveness grassland habitat"]
[null,"Other lowland acid grassland","Moderate","Moderate, Good","Other lowland acid grassland","Good",10,15,"Not Possible","Not Possible","Not Possible",10,15,"Condition enhancement only"]
[null,"Other neutral grassland","Moderate","Moderate, Good","Other neutral grassland","Good",5,10,"Not Possible","Not Possible","Not Possible",10,15,"Condition enhancement only"]
[null,"Upland acid grassland","Moderate","Moderate, Good","Upland acid grassland","Good",10,15,"Not Possible","Not Possible","Not Possible",10,15,"Condition enhancement only"]
[null,"Blackthorn scrub","Moderate","Moderate, Good","Blackthorn scrub","Good",5,10,"Not Possible","Not Possible","Not Possible",3,10,"Condition enhancement only"]
[null,"Bramble scrub","Condition Assessment N/A","Condition Assessment N/A","Blackthorn scrub, Gorse scrub, Hawthorn scrub, Hazel scrub, Mixed scrub, Willow scrub","Not Possible","Not Possible","Not Possible","Not Possible",1,"Not Possible","Not Possible","Not Possible","Condition enhancement not possible, enhancement to any medium distinctiveness habitat in heathland or shrub habitat only"]
[null,"Gorse scrub","Moderate","Moderate, Good","Gorse scrub","Good",5,10,"Not Possible","Not Possible","Not Possible",3,10,"Condition enhancement only"]
[null,"Hawthorn scrub","Moderate","Moderate, Good","Hawthorn scrub","Good",5,10,"Not Possible","Not Possible","Not Possible",3,10,"Condition enhancement only"]
[null,"Hazel scrub","Moderate","Moderate, Good","Hazel scrub","Good",10,15,"Not Possible","Not Possible","Not Possible",7,15,"Condition enhancement only"]
[null,"Mixed scrub","Moderate","Moderate, Good","Mixed scrub","Good",5,10,"Not Possible","Not Possible","Not Possible",3,10,"Condition enhancement only"]
[null,"Rhododendron scrub","Condition Assessment N/A","Condition Assessment N/A","Blackthorn scrub, Gorse scrub, Hawthorn scrub, Hazel scrub, Mixed scrub, Willow scrub","Not Possible","Not Possible","Not Possible","Not Possible",1,"Not Possible","Not Possible","Not Possible","Condition enhancement not possible, enhancement to any medium distinctiveness habitat in heathland or shrub habitat only"]
[null,"Other sea buckthorn scrub","Condition Assessment N/A","Condition Assessment N/A","Blackthorn scrub, Gorse scrub, Hawthorn scrub, Hazel scrub, Mixed scrub, Willow scrub","Not Possible","Not Possible","Not Possible","Not Possible",1,"Not Possible","Not Possible","Not Possible","Condition enhancement not possible, enhancement to any medium distinctiveness habitat in heathland or shrub habitat only"]
[null,"Willow scrub","Moderate","Moderate, Good","Willow scrub","Good",10,15,"Not Possible","Not Possible","Not Possible",7,15,"Condition enhancement only"]
[null,"Ornamental lake or pond","Moderate","Moderate, Good","Ornamental lake or pond, Ponds (non-priority habitat)","Good",3,5,"Not Possible","Not Possible","Not Possible",4,5,"Condition enhancement or enhancement to non-priority pond only"]
[null,"Ponds (non-priority habitat)","Moderate","Moderate, Good","Ponds (non-priority habitat)","Good",3,5,"Not Possible","Not Possible","Not Possible",4,5,"Condition enhancement only"]
[null,"Reservoirs","Moderate","Moderate, Good","Reservoirs","Good",5,10,"Not Possible","Not Possible","Not Possible",20,10,"Condition enhancement only"]
[null,"Ruderal/Ephemeral","Moderate","Moderate, Good","Ruderal/Ephemeral","Good",3,5,"Not Possible","Not Possible","Not Possible",2,"Not Possible","Condition enhancement only"]
[null,"Other inland rock and scree","Moderate","Moderate, Good","Other inland rock and scree","Good",10,20,"Not Possible","Not Possible","Not Possible",10,20,"Condition enhancement only"]
[null,"Tall forbs","Moderate","Moderate, Good","Tall forbs","Good",3,5,"Not Possible","Not Possible","Not Possible",2,"Not Possible","Condition enhancement only"]
[null,"Allotments","Moderate","Moderate, Good","Allotments","Good",1,1,"Not Possible","Not Possible","Not Possible",1,1,"Condition enhancement only"]
[null,"Artificial unvegetated, unsealed surface","N/A - Other","N/A - Other","Enhancement not possible","Not Possible","Not Possible","Not Possible","Not Possible","Not Possible",0,"Not Possible","Not Possible","Enhancement not possible"]
[null,"Bioswale","Moderate","Moderate, Good","Bioswale","Good",1,3,"Not Possible","Not Possible","Not Possible",2,3,"Condition enhancement only"]
[null,"Biodiverse green roof","Moderate","Moderate, Good","Biodiverse green roof","Good",5,10,"Not Possible","Not Possible","Not Possible",5,10,"Condition enhancement only"]
[null,"Built linear features","N/A - Other","N/A - Other","Enhancement not possible","Not Possible","Not Possible","Not Possible","Not Possible","Not Possible",0,"Not Possible","Not Possible","Enhancement not possible"]
[null,"Cemeteries and churchyards","Moderate","Moderate, Good","Cemeteries and churchyards","Good",15,20,"Not Possible","Not Possible","Not Possible",15,20,"Condition enhancement only"]
[null,"Developed land; sealed surface","N/A - Other","N/A - Other","Enhancement not possible","Not Possible","Not Possible","Not Possible","Not Possible","Not Possible",0,"Not Possible","Not Possible","Enhancement not possible"]
[null,"Other green roof","Condition Assessment N/A","Condition Assessment N/A","Biodiverse green roof","Not Possible","Not Possible","Not Possible","Not Possible",1,"Not Possible","Not Possible","Not Possible","Enhancement to Biodiverse green roof."]
[null,"Facade-bound green wall","Moderate","Moderate, Good","Facade-bound green wall","Good",3,5,"Not Possible","Not Possible","Not Possible",2,5,"Condition enhancement only"]
[null,"Ground based green wall","Moderate","Moderate, Good","Ground based green wall","Good",3,5,"Not Possible","Not Possible","Not Possible",2,5,"Condition enhancement only"]
[null,"Ground level planters","Condition Assessment N/A","Condition Assessment N/A","Enhancement not possible","Not Possible","Not Possible","Not Possible","Not Possible",1,"Not Possible","Not Possible","Not Possible","Enhancement not possible"]
[null,"Intensive green roof","Moderate","Moderate, Good","Intensive green roof, Biodiverse green roof","Good",3,5,"Not Possible","Not Possible","Not Possible",2,10,"Condition enhancement possible, enhancement to Intensive green roof and Biodiverse green roof"]
[null,"Introduced shrub","Condition Assessment N/A","Condition Assessment N/A","Enhancement not possible","Not Possible","Not Possible","Not Possible","Not Possible",1,"Not Possible","Not Possible","Not Possible","Enhancement not possible"]
[null,"Rain garden","Moderate","Moderate, Good","Rain garden","Good",3,5,"Not Possible","Not Possible","Not Possible",1,1,"Condition enhancement only"]
[null,"Actively worked sand pit quarry or open cast mine","Condition Assessment N/A","Condition Assessment N/A","Other inland rock and scree","Not Possible","Not Possible","Not Possible","Not Possible",1,"Not Possible","Not Possible","Not Possible","Condition enhancement not possible, enhancement to Sparsely vegetated land - other inland rock and scree only"]
[null,"Urban/rural tree","Moderate","Moderate, Good","Urban/rural tree","Good",27,"30+","Not Possible","Not Possible","Not Possible",16,"Not Possible","Enhancement not possible"]
[null,"Sustainable drainage system","Moderate","Moderate, Good","Sustainable drainage system","Good",3,5,"Not Possible","Not Possible","Not Possible",2,5,"Condition enhancement only"]
[null,"Unvegetated garden","N/A - Other","N/A - Other","Enhancement not possible","Not Possible","Not Possible","Not Possible","Not Possible","Not Possible",0,"Not Possible","Not Possible","Enhancement not possible"]
[null,"Vacant or derelict land","Moderate","Moderate, Good","Vacant or derelict land","Good",3,5,"Not Possible","Not Possible","Not Possible",1,1,"Condition enhancement only"]
[null,"Vegetated garden","Condition Assessment N/A","Condition Assessment N/A","Enhancement not possible","Not Possible","Not Possible","Not Possible","Not Possible",1,"Not Possible",2,5,"Condition enhancement only"]
[null,"Bare ground","Moderate","Moderate, Good","Bare ground","Good",3,5,"Not Possible","Not Possible","Not Possible",1,1,"Condition enhancement only"]
[null,"Other coniferous woodland","Moderate","Moderate, Good","Other Scot's pine woodland, Other woodland; broadleaved, Other woodland; mixed","Good",30,"30+","Not Possible","Not Possible","Not Possible","30+","Not Possible","Condition enhancement or enhancement to any medium distinctiveness woodland"]
[null,"Other Scot's pine woodland","Moderate","Moderate, Good","Other Scot's pine woodland","Good","30+","30+","Not Possible","Not Possible","Not Possible",15,"30+","Condition enhancement only"]
[null,"Other woodland; broadleaved","Moderate","Moderate, Good","Other woodland; broadleaved","Good",15,"30+","Not Possible","Not Possible","Not Possible",10,25,"Condition enhancement only"]
[null,"Other woodland; mixed","Moderate","Moderate, Good","Other woodland; mixed","Good",30,"30+","Not Possible","Not Possible","Not Possible",10,25,"Condition enhancement only"]
[null,"Littoral coarse sediment","Moderate","Moderate, Good","Littoral coarse sediment","Good",1,3,"Not Possible","Not Possible","Not Possible",2,"Not Possible","Condition enhancement only"]
[null,"Artificial saltmarshes and saline reedbeds","Moderate","Moderate, Good","Artificial saltmarshes and saline reedbeds","Good",7,15,"Not Possible","Not Possible","Not Possible",14,"Not Possible","Condition enhancement only"]
[null,"Artificial littoral coarse sediment","Moderate","Moderate, Good","Artificial littoral coarse sediment","Good",1,3,"Not Possible","Not Possible","Not Possible",2,"Not Possible","Condition enhancement only"]
[null,"Artificial littoral mud","Moderate","Moderate, Good","Artificial littoral mud","Good",3,6,"Not Possible","Not Possible","Not Possible",4,"Not Possible","Condition enhancement only"]
[null,"Artificial littoral sand","Moderate","Moderate, Good","Artificial littoral sand","Good",1,4,"Not Possible","Not Possible","Not Possible",3,"Not Possible","Condition enhancement only"]
[null,"Artificial littoral muddy sand","Moderate","Moderate, Good","Artificial littoral muddy sand","Good",3,5,"Not Possible","Not Possible","Not Possible",4,"Not Possible","Condition enhancement only"]
[null,"Artificial littoral mixed sediments","Moderate","Moderate, Good","Artificial littoral mixed sediments","Good",3,5,"Not Possible","Not Possible","Not Possible",2,"Not Possible","Condition enhancement only"]
[null,"Artificial littoral seagrass","Moderate","Moderate, Good","Artificial littoral seagrass","Good",10,20,"Not Possible","Not Possible","Not Possible",20,"Not Possible","Condition enhancement only"]
[null,"Artificial littoral biogenic reefs","Moderate","Moderate, Good","Artificial littoral biogenic reefs","Good",5,15,"Not Possible","Not Possible","Not Possible",6,"Not Possible","Condition enhancement only"]
[null,"Littoral sand","Moderate","Moderate, Good","Littoral sand","Good",1,4,"Not Possible","Not Possible","Not Possible",3,"Not Possible","Condition enhancement only"]
[null,"Artificial hard structures","Moderate","Moderate, Good","Artificial hard structures, Artificial hard structures with integrated greening of grey infrastructure (IGGI)","Good",5,15,"Not Possible","Not Possible","Not Possible",8,"Not Possible","Condition enhancement within same distinctiveness or enhancement to medium distinctiveness habitat"]
[null,"Artificial features of hard structures","Moderate","Moderate, Good","Artificial features of hard structures, Artificial hard structures with integrated greening of grey infrastructure (IGGI)","Good",4,13,"Not Possible","Not Possible","Not Possible",7,"Not Possible","Condition enhancement within same distinctiveness or enhancement to medium distinctiveness habitat"]
[null,"Artificial hard structures with integrated greening of grey infrastructure (IGGI)","Moderate","Moderate, Good","Artificial hard structures with integrated greening of grey infrastructure (IGGI)","Good",4,13,"Not Possible","Not Possible","Not Possible",7,13,"Condition enhancement only"]
[null,"Species-rich native hedgerow","Moderate","Moderate, Good","Species-rich native hedgerow","Good",5,12,"Not Possible","Not Possible","Not Possible",2,5,"Condition enhancement only"]
[null,"Native hedgerow - associated with bank or ditch","Moderate","Moderate, Good","Native hedgerow - associated with bank or ditch","Good",5,12,"Not Possible","Not Possible","Not Possible",2,6,"Condition enhancement only"]
[null,"Native hedgerow with trees","Moderate","Moderate, Good","Native hedgerow with trees","Good",10,20,"Not Possible","Not Possible","Not Possible",4,12,"Condition enhancement only"]
[null,"Native hedgerow","Moderate","Moderate, Good","Native hedgerow, Species-rich native hedgerow, Native hedgerow - associated with bank or ditch, Native hedgerow with trees","Good",5,12,"Not Possible","Not Possible","Not Possible",2,"Not Possible","Condition enhancement or enhancement to any medium distinctiveness hedgerow"]
[null,"Non-native and ornamental hedgerow","Poor","Poor","Enhancement not possible","Not Possible","Not Possible","Not Possible",1,"Not Possible","Not Possible","Not Possible","Not Possible","Enhancement not possible"]
[null,"Line of trees","Moderate","Moderate, Good"," Native hedgerow with trees, Line of trees, Line of trees - associated with bank or ditch","Good",20,"30+","Not Possible","Not Possible","Not possible",10,"Not possible","Condition enhancement or enhancement to an ecologically valuable line of trees or any medium distinctiveness hedgerow - i.e. should retain trees"]
[null,"Ecologically valuable line of trees","Moderate","Moderate, Good","Ecologically valuable line of trees, Ecologically valuable line of trees - associated with bank or ditch, ","Good",20,"30+","Not Possible","Not Possible","Not Possible",10,"Not Possible","Condition enhancement or enhance to an Ecologically valuable line of trees - associated with bank or ditch"]
[null,"Line of trees - associated with bank or ditch","Moderate","Moderate, Good"," Line of trees - associated with bank or ditch","Good",20,"30+","Not Possible","Not Possible","Not Possible",10,10,"Condition enhancement or enhancement to an ecologically valuable line of trees or any medium distinctiveness hedgerow - i.e. should retain trees"]
[null,"Ecologically valuable line of trees - associated with bank or ditch","Moderate","Moderate, Good","Ecologically valuable line of trees - associated with bank or ditch,","Good",20,"30+","Not Possible","Not Possible","Not Possible",10,10,"Condition enhancement only"]
[null,"Ditches","Moderate","Moderate, Good","Ditches","Good",5,10,"Not Possible","Not Possible","Not Possible",4,10,"Condition enhancement only"]
[null,"Canals","Moderate","Moderate, Good","Canals","Good",5,10,"Not Possible","Not Possible","Not Possible",4,10,"Condition enhancement only"]
[null,"Culvert","Poor","Poor","Canals, Ditches","Not Possible","Not Possible","Not Possible",1,"Not Possible","Not Possible","Not Possible","Not Possible","Enhancement to Canal or Ditch"]

{"sheet":"11. Lists","index":10,"n_rows":412,"n_cols":29,"rows_kept":412,"merged":[[32,9,32,10],[33,1,33,3],[33,5,33,7],[33,12,33,13],[33,16,33,19],[44,1,44,3],[44,5,44,6],[44,8,44,10],[44,12,44,15],[44,18,44,20]]}
["Broadhabitattype",null,"Cropland",null,"Grassland",null,"Heathlandandshrub",null,"Intertidalhardstructures",null,"Intertidalsediment",null,"Lakes",null,"Sparselyvegetatedland",null,"Urban",null,"Woodlandandforest",null,"HedgerowsandLinesoftrees",null,"Lineoftrees",null,"Watercourses",null,"Coastalsaltmarsh",null,"Individualtrees"]
["Cropland",null,"Arable field margins cultivated annually",null,"Bracken",null,"Blackthorn scrub",null,"Artificial hard structures",null,"Littoral coarse sediment",null,"Ornamental lake or pond",null,"Ruderal/Ephemeral",null,"Allotments",null,"Other coniferous woodland",null,"Species-rich native hedgerow",null,"Line of trees",null,"Canals",null,"Artificial saltmarshes and saline reedbeds",null,"Urban/rural tree"]
["Grassland",null,"Arable field margins game bird mix",null,"Modified grassland",null,"Bramble scrub",null,"Artificial features of hard structures",null,"Artificial littoral coarse sediment",null,"Ponds (non-priority habitat)",null,"Other inland rock and scree",null,"Artificial unvegetated, unsealed surface",null,"Other Scot's pine woodland",null,"Native hedgerow - associated with bank or ditch",null,"Ecologically valuable line of trees",null,"Culvert"]
["Heathland and shrub",null,"Arable field margins pollen and nectar",null,"Other lowland acid grassland",null,"Gorse scrub",null,"Artificial hard structures with integrated greening of grey infrastructure (IGGI)",null,"Artificial littoral mud",null,"Reservoirs",null,"Tall forbs",null,"Bioswale",null,"Other woodland; broadleaved",null,"Native hedgerow with trees",null,"Line of trees - associated with bank or ditch",null,"Ditches"]
["Intertidal hard structures",null,"Arable field margins tussocky",null,"Other neutral grassland",null,"Hawthorn scrub",{"$nulls":3},"Artificial littoral sand",{"$nulls":5},"Biodiverse green roof",null,"Other woodland; mixed",null,"Native hedgerow",null,"Ecologically valuable line of trees - associated with bank or ditch"]
["Intertidal sediment",null,"Cereal crops",null,"Upland acid grassland",null,"Hazel scrub",{"$nulls":3},"Artificial littoral muddy sand",{"$nulls":5},"Built linear features",{"$nulls":3},"Non-native and ornamental hedgerow"]
["Lakes",null,"Winter stubble",{"$nulls":3},"Mixed scrub",{"$nulls":3},"Artificial littoral mixed sediments",{"$nulls":5},"Cemeteries and churchyards",{"$nulls":3},"Line of trees"]
["Sparsely vegetated land",null,"Horticulture",{"$nulls":3},"Rhododendron scrub",{"$nulls":3},"Artificial littoral seagrass",{"$nulls":5},"Developed land; sealed surface",{"$nulls":3},"Ecologically valuable line of trees"]
["Urban",null,"Intensive orchards",{"$nulls":3},"Other sea buckthorn scrub",{"$nulls":3},"Artificial littoral biogenic reefs",{"$nulls":5},"Other green roof",{"$nulls":3},"Line of trees - associated with bank or ditch"]
["Woodland and forest",null,"Non-cereal crops",{"$nulls":3},"Willow scrub",{"$nulls":3},"Littoral sand",{"$nulls":5},"Facade-bound green wall",{"$nulls":3},"Ecologically valuable line of trees - associated with bank or ditch"]
["Coastal saltmarsh",null,"Temporary grass and clover leys",{"$nulls":13},"Ground based green wall"]
[{"$nulls":16},"Ground level planters"]
[{"$nulls":16},"Intensive green roof"]
[{"$nulls":16},"Introduced shrub"]
[{"$nulls":16},"Rain garden"]
[{"$nulls":16},"Actively worked sand pit quarry or open cast mine"]
[{"$nulls":16},"Sustainable drainage system"]
[{"$nulls":16},"Unvegetated garden"]
[{"$nulls":16},"Vacant or derelict land"]
[{"$nulls":16},"Vegetated garden"]
[{"$nulls":16},"Bare ground"]
[]
[]
[]
[]
[]
[]
["Rivers",null,"Linear features"]
["Rivers",null,"Hedgerows and Lines of trees"]
[]
[]
[]
[{"$nulls":9},"difficulty"]
[null,"Connectivity",{"$nulls":3},"Strategic Significance",{"$nulls":3},"category","value",null,"Spatial  risk",{"$nulls":3},"Street trees"]
[null,"Score","Description","score",null,"Description","strategic significance","Multiplier",null,"Low",1,null,"Category","Multiplier",null,null,"Tree size","Diameter M","RPA Radius M","RPA ha",null,null,"Local Authority List","Application type"]
[null,"High","Highly connected habitat",1.15,null,"Formally identified in local strategy","High strategic significance ",1.15,null,"Medium",0.67,null,"Compensation inside LPA or NCA, or deemed to be sufficiently local, to site of biodiversity loss",1,null,null,"Small",0.3,{"$f":"R36*12","v":3.5999999999999996},{"$f":"3.14*(S36*S36)/10000","v":{"v":0.00406944,"d":"0.0041"}},null,null,"Adur and Worthing Borough Council","Householder planning consent"]
[null,"Medium","Moderately connected habitat",1.1,null,"Area/compensation not in local strategy/ no local strategy","Low Strategic Significance",1,null,"High",0.33,null,"Compensation outside LPA or NCA of impact site but in neighbouring LPA or NCA",0.75,null,null,"Medium",0.9,{"$f":"R37*12","v":10.8},{"$f":"3.14*(S37*S37)/10000","v":{"v":0.036624960000000005,"d":"0.0366"}},null,null,"Adur District Council","Full planning consent"]
[null,"Low","Unconnected habitat",1,{"$nulls":5},"Very High",0.1,null,"Compensation outside LPA or NCA of impact site and beyond neighbouring LPA or NCA ",0.5,null,null,"Large",1.3,{"$f":"R38*12","v":15.600000000000001},{"$f":"3.14*(S38*S38)/10000","v":{"v":0.07641504000000002,"d":"0.0764"}},null,null,"Allerdale Borough Council","Hybrid planning consent"]
[null,"N/A","Assessment not appropriate",1,{"$nulls":18},"Amber Valley Borough Council","Outline planning consent"]
[{"$nulls":22},"Arun District Council","Reserved Matters"]
[{"$nulls":22},"Ashfield District Council","Application for non-material amendments"]
[{"$nulls":22},"Ashford Borough Council"]
[{"$nulls":22},"Aylesbury Vale District Council"]
[{"$nulls":22},"Babergh District Council"]
[null,"Distinctiveness categories",{"$nulls":3},"Condition categories",null,null,"Temporal multipliers",{"$nulls":3},"Individual trees",{"$nulls":5},"Hedges Distinctiveness categories",{"$nulls":3},"Barnsley Metropolitan Borough Council"]
[null,"Distinctiveness Category","Distinctiveness Score","Suggested Action",null,"Condition Multiplier","Condition Assessment Score",null,"Year","% of original unit","Time to target Multiplier",null,"Tree size","Diameter M","RPA Radius M","RPA m2",null,null,"Distinctiveness Category","Distinctiveness Score","Suggested Action",null,"Barrow-in-Furness Borough Council"]
[null,"Medium",4,"Same broad habitat or a higher distinctiveness habitat required",null,"Good",3,null,0,100,{"v":1,"d":"1.000"},null,"Small",0.3,{"$f":"N47*12","v":3.5999999999999996},{"$f":"3.14*(O47*O47)","v":{"v":40.694399999999995,"d":"40.6944"}},null,null,"Medium",4,"Same broad habitat or a higher distinctiveness habitat required",null,"Basildon Borough Council"]
[null,"Low",2,"Same distinctiveness or better habitat required",null,"Moderate",2,null,1,96.5,0.965,null,"Medium",0.6,7.2,{"$f":"3.14*(O48*O48)","v":162.7776},null,null,"Low",2,"Same distinctiveness or better habitat required",null,"Basingstoke and Deane Borough Council"]
[null,"V.Low",0,"Compensation Not Required",null,"Poor",1,null,2,93.1225,{"v":0.931225,"d":"0.931"},null,"Large",0.9,10.8,{"$f":"3.14*(O49*O49)","v":{"v":366.24960000000004,"d":"366.2496"}},null,null,"V.Low",1,"Compensation Not Required",null,"Bassetlaw District Council"]
[null,"High",6,"Same broad habitat or a higher distinctiveness habitat required",null,"Condition Assessment N/A",1,null,3,89.8632125,{"v":0.898632125,"d":"0.899"},null,"Very Large",1.3,15.6,{"$f":"3.14*(O50*O50)","v":764.1504},null,null,"High",6,"Same broad habitat or a higher distinctiveness habitat required",null,"Bath and North East Somerset Council"]
[{"$nulls":5},"N/A - Other",0,null,4,86.71800006,{"v":0.8671800005999999,"d":"0.867"},{"$nulls":11},"Bedford Borough Council"]
[{"$nulls":8},5,83.68287006,{"v":0.8368287006,"d":"0.837"},{"$nulls":11},"Birmingham City Council"]
[{"$nulls":8},6,80.75396961,{"v":0.8075396961,"d":"0.808"},{"$nulls":11},"Blaby District Council"]
[{"$nulls":8},7,77.92758067,{"v":0.7792758067,"d":"0.779"},{"$nulls":11},"Blackburn with Darwen Borough Council"]
[{"$nulls":8},8,75.20011535,{"v":0.7520011535000001,"d":"0.752"},{"$nulls":11},"Blackpool Borough Council"]
[{"$nulls":8},9,72.56811131,{"v":0.7256811131,"d":"0.726"},{"$nulls":11},"Blaenau Gwent County Borough Council"]
[{"$nulls":8},10,70.02822742,{"v":0.7002822741999999,"d":"0.700"},{"$nulls":11},"Bolsover District Council"]
[{"$nulls":8},11,67.57723946,{"v":0.6757723946,"d":"0.676"},{"$nulls":11},"Bolton Metropolitan Borough Council"]
[{"$nulls":8},12,65.21203607,{"v":0.6521203607,"d":"0.652"},{"$nulls":11},"Borough of Broxbourne"]
[{"$nulls":8},13,62.92961481,{"v":0.6292961481,"d":"0.629"},{"$nulls":11},"Borough of Poole"]
[{"$nulls":8},14,60.72707829,{"v":0.6072707829,"d":"0.607"},{"$nulls":11},"Boston Borough Council"]
[{"$nulls":8},15,58.60163055,{"v":0.5860163055000001,"d":"0.586"},{"$nulls":11},"Bournemouth Borough Council"]
[{"$nulls":8},16,56.55057348,{"v":0.5655057348,"d":"0.566"},{"$nulls":11},"Bracknell Forest Council"]
[{"$nulls":8},17,54.57130341,{"v":0.5457130340999999,"d":"0.546"},{"$nulls":11},"Bradford Metropolitan District Council"]
[{"$nulls":8},18,52.66130779,{"v":0.5266130779,"d":"0.527"},{"$nulls":11},"Braintree District Council"]
[{"$nulls":8},19,50.81816202,{"v":0.5081816202,"d":"0.508"},{"$nulls":11},"Breckland District Council"]
[{"$nulls":8},20,49.03952635,{"v":0.4903952635,"d":"0.490"},{"$nulls":11},"Brentwood Borough Council"]
[{"$nulls":8},21,47.32314293,{"v":0.4732314293,"d":"0.473"},{"$nulls":11},"Bridgend County Borough Council"]
[{"$nulls":8},22,45.66683292,{"v":0.4566683292,"d":"0.457"},{"$nulls":11},"Brighton and Hove City Council"]
[{"$nulls":8},23,44.06849377,{"v":0.44068493770000006,"d":"0.441"},{"$nulls":11},"Bristol City Council"]
[{"$nulls":8},24,42.52609649,{"v":0.4252609649,"d":"0.425"},{"$nulls":11},"Broadland District Council"]
[{"$nulls":8},25,41.03768311,{"v":0.4103768311,"d":"0.410"},{"$nulls":11},"Bromsgrove District Council"]
[{"$nulls":8},26,39.6013642,{"v":0.396013642,"d":"0.396"},{"$nulls":11},"Broxtowe Borough Council"]
[{"$nulls":8},27,38.21531646,{"v":0.3821531646,"d":"0.382"},{"$nulls":11},"Buckinghamshire County Council"]
[{"$nulls":8},28,36.87778038,{"v":0.36877780379999997,"d":"0.369"},{"$nulls":11},"Burnley Borough Council"]
[{"$nulls":8},29,35.58705807,{"v":0.3558705807,"d":"0.356"},{"$nulls":11},"Bury Metropolitan Borough Council"]
[{"$nulls":8},30,34.34151104,{"v":0.3434151104,"d":"0.343"},{"$nulls":11},"Caerphilly County Borough Council"]
[{"$nulls":8},31,33.13955815,{"v":0.3313955815,"d":"0.331"},{"$nulls":11},"Calderdale Metropolitan Borough Council"]
[{"$nulls":8},"30+",31.97967361,{"v":0.3197967361,"d":"0.320"},{"$nulls":11},"Cambridge City Council"]
[{"$nulls":8},"Not Possible","N/A","N/A",{"$nulls":11},"Cambridgeshire County Council"]
[{"$nulls":22},"Cannock Chase District Council"]
[{"$nulls":22},"Canterbury City Council"]
[{"$nulls":22},"Cardiff Council"]
[{"$nulls":22},"Carlisle City Council"]
[{"$nulls":22},"Carmarthenshire County Council"]
[{"$nulls":22},"Castle Point Borough Council"]
[{"$nulls":22},"Central Bedfordshire Council"]
[{"$nulls":22},"Ceredigion County Council"]
[{"$nulls":22},"Charnwood Borough Council"]
[{"$nulls":22},"Chelmsford City Council"]
[{"$nulls":22},"Cheltenham Borough Council"]
[{"$nulls":22},"Cherwell District Council"]
[{"$nulls":22},"Cheshire East Council (Unitary)"]
[{"$nulls":22},"Cheshire West and Chester Council"]
[{"$nulls":22},"Chesterfield Borough Council"]
[{"$nulls":22},"Chichester District Council"]
[{"$nulls":22},"Chiltern District Council"]
[{"$nulls":22},"Chorley Council"]
[{"$nulls":22},"Christchurch Borough Council"]
[{"$nulls":22},"City of Lincoln Council"]
[{"$nulls":22},"City of London"]
[{"$nulls":22},"City of York Council"]
[{"$nulls":22},"Colchester Borough Council"]
[{"$nulls":22},"Conwy County Borough Council"]
[{"$nulls":22},"Copeland Borough Council"]
[{"$nulls":22},"Corby Borough Council"]
[{"$nulls":22},"Cornwall Council (Unitary)"]
[{"$nulls":22},"Cotswold District Council"]
[{"$nulls":22},"Coventry City Council"]
[{"$nulls":22},"Craven District Council"]
[{"$nulls":22},"Crawley Borough Council"]
[{"$nulls":22},"Cumbria County Council"]
[{"$nulls":22},"Dacorum Council"]
[{"$nulls":22},"Darlington Borough Council"]
[{"$nulls":22},"Dartford Borough Council"]
[{"$nulls":22},"Daventry District Council"]
[{"$nulls":22},"Denbighshire County Council"]
[{"$nulls":22},"Derby City Council"]
[{"$nulls":22},"Derbyshire County Council"]
[{"$nulls":22},"Derbyshire Dales District Council"]
[{"$nulls":22},"Devon County Council"]
[{"$nulls":22},"Doncaster Metropolitan Borough Council"]
[{"$nulls":22},"Dorset County Council"]
[{"$nulls":22},"Dover District Council"]
[{"$nulls":22},"Dudley Metropolitan Borough Council"]
[{"$nulls":22},"Durham County Council"]
[{"$nulls":22},"East Cambridgeshire District Council"]
[{"$nulls":22},"East Devon District Council"]
[{"$nulls":22},"East Dorset District Council"]
[{"$nulls":22},"East Hampshire District Council"]
[{"$nulls":22},"East Hertfordshire District Council"]
[{"$nulls":22},"East Lindsey District Council"]
[{"$nulls":22},"East Northamptonshire Council"]
[{"$nulls":22},"East Riding of Yorkshire Council"]
[{"$nulls":22},"East Staffordshire Borough Council"]
[{"$nulls":22},"East Sussex County Council"]
[{"$nulls":22},"Eastbourne Borough Council"]
[{"$nulls":22},"Eastleigh Borough Council"]
[{"$nulls":22},"Eden District Council"]
[{"$nulls":22},"Elmbridge Borough Council"]
[{"$nulls":22},"Epping Forest District Council"]
[{"$nulls":22},"Epsom and Ewell Borough Council"]
[{"$nulls":22},"Erewash Borough Council"]
[{"$nulls":22},"Essex County Council"]
[{"$nulls":22},"Exeter City Council"]
[{"$nulls":22},"Fareham Borough Council"]
[{"$nulls":22},"Fenland District Council"]
[{"$nulls":22},"Flintshire County Council"]
[{"$nulls":22},"Forest Heath District Council"]
[{"$nulls":22},"Forest of Dean District Council"]
[{"$nulls":22},"Fylde Borough Council"]
[{"$nulls":22},"Gateshead Metropolitan Borough Council"]
[{"$nulls":22},"Gedling Borough Council"]
[{"$nulls":22},"Gloucester City Council"]
[{"$nulls":22},"Gloucestershire County Council"]
[{"$nulls":22},"Gosport Borough Council"]
[{"$nulls":22},"Gravesham Borough Council"]
[{"$nulls":22},"Great Yarmouth Borough Council"]
[{"$nulls":22},"Guildford Borough Council"]
[{"$nulls":22},"Gwynedd County Council"]
[{"$nulls":22},"Halton Borough Council"]
[{"$nulls":22},"Hambleton District Council"]
[{"$nulls":22},"Hampshire County Council"]
[{"$nulls":22},"Harborough District Council"]
[{"$nulls":22},"Harlow Council"]
[{"$nulls":22},"Harrogate Borough Council"]
[{"$nulls":22},"Hart District Council"]
[{"$nulls":22},"Hartlepool Borough Council"]
[{"$nulls":22},"Hastings Borough Council"]
[{"$nulls":22},"Havant Borough Council"]
[{"$nulls":22},"Herefordshire Council"]
[{"$nulls":22},"Hertfordshire County Council"]
[{"$nulls":22},"Hertsmere Borough Council"]
[{"$nulls":22},"High Peak Borough Council"]
[{"$nulls":22},"Hinckley and Bosworth Borough Council"]
[{"$nulls":22},"Horsham District Council"]
[{"$nulls":22},"Huntingdonshire District Council"]
[{"$nulls":22},"Hyndburn Borough Council"]
[{"$nulls":22},"Ipswich Borough Council"]
[{"$nulls":22},"Isle of Anglesey County Council"]
[{"$nulls":22},"Isle of Wight Council"]
[{"$nulls":22},"Isles of Scilly"]
[{"$nulls":22},"Kent County Council"]
[{"$nulls":22},"Kettering Borough Council"]
[{"$nulls":22},"King's Lynn and West Norfolk Borough Council"]
[{"$nulls":22},"Kingston-upon-Hull City Council"]
[{"$nulls":22},"Kirklees Council"]
[{"$nulls":22},"Knowsley Metropolitan Borough Council"]
[{"$nulls":22},"Lancashire County Council"]
[{"$nulls":22},"Lancaster City Council"]
[{"$nulls":22},"Leeds City Council"]
[{"$nulls":22},"Leicester City Council"]
[{"$nulls":22},"Leicestershire County Council"]
[{"$nulls":22},"Lewes District Council"]
[{"$nulls":22},"Lichfield District Council"]
[{"$nulls":22},"Lincolnshire County Council"]
[{"$nulls":22},"Liverpool City Council"]
[{"$nulls":22},"London Borough of Barking and Dagenham"]
[{"$nulls":22},"London Borough of Barnet"]
[{"$nulls":22},"London Borough of Bexley"]
[{"$nulls":22},"London Borough of Brent"]
[{"$nulls":22},"London Borough of Bromley"]
[{"$nulls":22},"London Borough of Camden"]
[{"$nulls":22},"London Borough of Croydon"]
[{"$nulls":22},"London Borough of Ealing"]
[{"$nulls":22},"London Borough of Enfield"]
[{"$nulls":22},"London Borough of Hackney"]
[{"$nulls":22},"London Borough of Hammersmith & Fulham"]
[{"$nulls":22},"London Borough of Haringey"]
[{"$nulls":22},"London Borough of Harrow"]
[{"$nulls":22},"London Borough of Havering"]
[{"$nulls":22},"London Borough of Hillingdon"]
[{"$nulls":22},"London Borough of Hounslow"]
[{"$nulls":22},"London Borough of Islington"]
[{"$nulls":22},"London Borough of Lambeth"]
[{"$nulls":22},"London Borough of Lewisham"]
[{"$nulls":22},"London Borough of Merton"]
[{"$nulls":22},"London Borough of Newham"]
[{"$nulls":22},"London Borough of Redbridge"]
[{"$nulls":22},"London Borough of Richmond upon Thames"]
[{"$nulls":22},"London Borough of Southwark"]
[{"$nulls":22},"London Borough of Sutton"]
[{"$nulls":22},"London Borough of Tower Hamlets"]
[{"$nulls":22},"London Borough of Waltham Forest"]
[{"$nulls":22},"London Borough of Wandsworth"]
[{"$nulls":22},"Luton Borough Council"]
[{"$nulls":22},"Maidstone Borough Council"]
[{"$nulls":22},"Maldon District Council"]
[{"$nulls":22},"Malvern Hills District Council"]
[{"$nulls":22},"Manchester City Council"]
[{"$nulls":22},"Mansfield District Council"]
[{"$nulls":22},"Medway Council"]
[{"$nulls":22},"Melton Borough Council"]
[{"$nulls":22},"Mendip District Council"]
[{"$nulls":22},"Merthyr Tydfil County Borough Council"]
[{"$nulls":22},"Mid Devon District Council"]
[{"$nulls":22},"Mid Suffolk District Council"]
[{"$nulls":22},"Mid Sussex District Council"]
[{"$nulls":22},"Middlesbrough Borough Council"]
[{"$nulls":22},"Milton Keynes"]
[{"$nulls":22},"Mole Valley District Council"]
[{"$nulls":22},"Monmouthshire County Council"]
[{"$nulls":22},"Neath Port Talbot County Borough Council"]
[{"$nulls":22},"New Forest District Council"]
[{"$nulls":22},"Newark and Sherwood District Council"]
[{"$nulls":22},"Newcastle-Under-Lyme District Council"]
[{"$nulls":22},"Newport City Council"]
[{"$nulls":22},"Newcastle-upon-Tyne City Council"]
[{"$nulls":22},"Norfolk County Council"]
[{"$nulls":22},"North Devon Council"]
[{"$nulls":22},"North Dorset District Council"]
[{"$nulls":22},"North East Derbyshire District Council"]
[{"$nulls":22},"North East Lincolnshire Council"]
[{"$nulls":22},"North Hertfordshire District Council"]
[{"$nulls":22},"North Kesteven District Council"]
[{"$nulls":22},"North Lincolnshire Council"]
[{"$nulls":22},"North Norfolk District Council"]
[{"$nulls":22},"North Somerset Council"]
[{"$nulls":22},"North Tyneside Metropolitan Borough Council"]
[{"$nulls":22},"North Warwickshire Borough Council"]
[{"$nulls":22},"North West Leicestershire District Council"]
[{"$nulls":22},"North Yorkshire County Council"]
[{"$nulls":22},"Northampton Borough Council"]
[{"$nulls":22},"Northamptonshire County Council"]
[{"$nulls":22},"Northumberland Council"]
[{"$nulls":22},"Norwich City Council"]
[{"$nulls":22},"Nottingham City Council"]
[{"$nulls":22},"Nottinghamshire County Council"]
[{"$nulls":22},"Nuneaton and Bedworth Borough Council"]
[{"$nulls":22},"Oadby and Wigston District Council"]
[{"$nulls":22},"Oldham Metropolitan Borough Council"]
[{"$nulls":22},"Oxford City Council"]
[{"$nulls":22},"Oxfordshire County Council"]
[{"$nulls":22},"Pembrokeshire County Council"]
[{"$nulls":22},"Pendle Borough Council"]
[{"$nulls":22},"Perth and Kinross Council"]
[{"$nulls":22},"Peterborough City Council"]
[{"$nulls":22},"Plymouth City Council"]
[{"$nulls":22},"Portsmouth City Council"]
[{"$nulls":22},"Powys County Council"]
[{"$nulls":22},"Preston City Council"]
[{"$nulls":22},"Purbeck District Council"]
[{"$nulls":22},"Reading Borough Council"]
[{"$nulls":22},"Redcar and Cleveland Council"]
[{"$nulls":22},"Redditch Borough Council"]
[{"$nulls":22},"Reigate & Banstead Borough Council"]
[{"$nulls":22},"Rhondda Cynon Taf County Borough Council"]
[{"$nulls":22},"Ribble Valley Borough Council"]
[{"$nulls":22},"Richmondshire District Council"]
[{"$nulls":22},"Rochdale Metropolitan Borough Council"]
[{"$nulls":22},"Rochford District Council"]
[{"$nulls":22},"Rossendale Borough Council"]
[{"$nulls":22},"Rother District Council"]
[{"$nulls":22},"Rotherham Metropolitan Borough Council"]
[{"$nulls":22},"Royal Borough of Greenwich"]
[{"$nulls":22},"Royal Borough of Kensington and Chelsea"]
[{"$nulls":22},"Royal Borough of Kingston upon Thames"]
[{"$nulls":22},"Royal Borough of Windsor and Maidenhead"]
[{"$nulls":22},"Rugby Borough Council"]
[{"$nulls":22},"Runnymede Borough Council"]
[{"$nulls":22},"Rushcliffe Borough Council"]
[{"$nulls":22},"Rushmoor Borough Council"]
[{"$nulls":22},"Rutland County Council"]
[{"$nulls":22},"Ryedale District Council"]
[{"$nulls":22},"Salford City Council"]
[{"$nulls":22},"Sandwell Metropolitan Borough Council"]
[{"$nulls":22},"Scarborough Borough Council"]
[{"$nulls":22},"Sedgemoor District Council"]
[{"$nulls":22},"Sefton Metropolitan Borough Council"]
[{"$nulls":22},"Selby District Council"]
[{"$nulls":22},"Sevenoaks District Council"]
[{"$nulls":22},"Sheffield City Council"]
[{"$nulls":22},"Shepway District Council"]
[{"$nulls":22},"Shropshire Council - Unitary"]
[{"$nulls":22},"Slough Borough Council"]
[{"$nulls":22},"Solihull Metropolitan Borough Council"]
[{"$nulls":22},"Somerset County Council"]
[{"$nulls":22},"South Buckinghamshire District Council"]
[{"$nulls":22},"South Cambridgeshire District Council"]
[{"$nulls":22},"South Derbyshire District Council"]
[{"$nulls":22},"South Gloucestershire Council"]
[{"$nulls":22},"South Hams District Council"]
[{"$nulls":22},"South Holland District Council"]
[{"$nulls":22},"South Kesteven District Council"]
[{"$nulls":22},"South Lakeland District Council"]
[{"$nulls":22},"South Norfolk District Council"]
[{"$nulls":22},"South Northamptonshire Council"]
[{"$nulls":22},"South Oxfordshire District Council"]
[{"$nulls":22},"South Ribble Borough Council"]
[{"$nulls":22},"South Somerset District Council"]
[{"$nulls":22},"South Staffordshire Council"]
[{"$nulls":22},"South Tyneside Council"]
[{"$nulls":22},"Southampton City Council"]
[{"$nulls":22},"Southend-on-Sea Borough Council"]
[{"$nulls":22},"Spelthorne Borough Council"]
[{"$nulls":22},"St Albans City and District Council"]
[{"$nulls":22},"St Edmundsbury Borough Council"]
[{"$nulls":22},"St Helens Metropolitan Borough Council"]
[{"$nulls":22},"Stafford Borough Council"]
[{"$nulls":22},"Staffordshire County Council"]
[{"$nulls":22},"Staffordshire Moorlands District Council"]
[{"$nulls":22},"Stevenage Borough Council"]
[{"$nulls":22},"Stockport Metropolitan Borough Council"]
[{"$nulls":22},"Stockton-on-Tees Borough Council"]
[{"$nulls":22},"Stoke-on-Trent City Council"]
[{"$nulls":22},"Strabane District Council"]
[{"$nulls":22},"Stratford-on-Avon District Council"]
[{"$nulls":22},"Stroud District Council"]
[{"$nulls":22},"Suffolk Coastal District Council"]
[{"$nulls":22},"Suffolk County Council"]
[{"$nulls":22},"Sunderland City Council"]
[{"$nulls":22},"Surrey County Council"]
[{"$nulls":22},"Surrey Heath Borough Council"]
[{"$nulls":22},"Swale Borough Council"]
[{"$nulls":22},"Swansea City and Borough Council"]
[{"$nulls":22},"Swindon Borough Council"]
[{"$nulls":22},"Tameside Metropolitan Borough Council"]
[{"$nulls":22},"Tamworth Borough Council"]
[{"$nulls":22},"Tandridge District Council"]
[{"$nulls":22},"Taunton Deane Borough Council"]
[{"$nulls":22},"Teignbridge District Council"]
[{"$nulls":22},"Telford & Wrekin Council"]
[{"$nulls":22},"Tendring District Council"]
[{"$nulls":22},"Test Valley Borough Council"]
[{"$nulls":22},"Tewkesbury Borough Council"]
[{"$nulls":22},"Thanet District Council"]
[{"$nulls":22},"Three Rivers District Council"]
[{"$nulls":22},"Thurrock Council"]
[{"$nulls":22},"Tonbridge and Malling Borough Council"]
[{"$nulls":22},"Torbay Council"]
[{"$nulls":22},"Torfaen County Borough Council"]
[{"$nulls":22},"Torridge District Council"]
[{"$nulls":22},"Trafford Metropolitan Borough Council"]
[{"$nulls":22},"Tunbridge Wells Borough Council"]
[{"$nulls":22},"Uttlesford District Council"]
[{"$nulls":22},"Vale of Glamorgan Council"]
[{"$nulls":22},"Vale of White Horse District Council"]
[{"$nulls":22},"Wakefield Metropolitan District Council"]
[{"$nulls":22},"Walsall Metropolitan Borough Council"]
[{"$nulls":22},"Warrington Borough Council"]
[{"$nulls":22},"Warwick District Council"]
[{"$nulls":22},"Warwickshire County Council"]
[{"$nulls":22},"Watford Borough Council"]
[{"$nulls":22},"Waveney District Council"]
[{"$nulls":22},"Waverley Borough Council"]
[{"$nulls":22},"Wealden District Council"]
[{"$nulls":22},"Wellingborough Borough Council"]
[{"$nulls":22},"Welwyn Hatfield Council"]
[{"$nulls":22},"West Berkshire Council"]
[{"$nulls":22},"West Devon Borough Council"]
[{"$nulls":22},"West Dorset District Council"]
[{"$nulls":22},"West Lancashire Borough Council"]
[{"$nulls":22},"West Lindsey District Council"]
[{"$nulls":22},"West Oxfordshire District Council"]
[{"$nulls":22},"West Somerset District Council"]
[{"$nulls":22},"West Sussex County Council"]
[{"$nulls":22},"Westminster City Council"]
[{"$nulls":22},"Weymouth and Portland Borough Council"]
[{"$nulls":22},"Wigan Metropolitan Borough Council"]
[{"$nulls":22},"Wiltshire Council"]
[{"$nulls":22},"Winchester City Council"]
[{"$nulls":22},"Wirral Council"]
[{"$nulls":22},"Woking Borough Council"]
[{"$nulls":22},"Wokingham Borough Council"]
[{"$nulls":22},"Wolverhampton City Council"]
[{"$nulls":22},"Worcester City Council"]
[{"$nulls":22},"Worcestershire County Council"]
[{"$nulls":22},"Wrexham County Borough Council"]
[{"$nulls":22},"Wychavon District Council"]
[{"$nulls":22},"Wycombe District Council"]
[{"$nulls":22},"Wyre Council"]
[{"$nulls":22},"Wyre Forest District Council"]

{"sheet":"12. Version history","index":11,"n_rows":10,"n_cols":5,"rows_kept":10,"merged":[[2,2,2,4]]}
[]
[]
[null,null,"Small sites metric version history"]
[null,null,"Version","Changes made","Date released"]
[null,null,"Version 1.0.0","Initial statutory version","29th November 2023"]
[null,null,"Version 1.0.1","Updated to correct some labelling errors, minor forumla errors and expand column widths","12th February 2024"]
[null,null,"Version 1.2.0","Fixed some discrepancies in difficulty of creation and enhancement for 3 habitat types","5th March 2024"]
[null,null,"Version 1.2.1","Unlocked Strategic Significance selection box for individual trees. Locked additional cells. Added version history. European protected species added to desktop assessment tab. Setting a unit target with a zero unit baseline is now optional for each module. The options for planning application type have been restricted. ","23rd July 2024"]
[null,null,"Version 1.2.2","Fix made to error specific to Version 1.2.1 relating to area checker on Area Habitats tab.","24th July 2024"]
[null,null,"Version 1.2.3","Difficulty of creation for actively worked sand pit quarry or open cast mine changed to medium for consistency with the main metric, 'habitat units' corrected to 'area habitat units' where appropriate.","3rd July 2025"]

{"sheet":"13. Habitats Translation","index":12,"n_rows":83,"n_cols":6,"rows_kept":83,"hidden":true,"merged":[[3,1,13,1],[3,2,6,2],[7,2,11,2],[14,1,18,1],[16,2,18,2],[19,1,26,1],[20,2,26,2],[27,1,37,1],[27,2,29,2],[30,2,32,2],[34,2,37,2],[38,1,40,1],[41,1,50,1],[51,1,52,1],[53,1,55,1],[56,1,57,1],[58,1,78,1],[63,2,64,2],[67,2,68,2],[76,2,77,2],[79,1,82,1],[79,2,80,2]]}
[]
[null,"BNG Group","Landsacpe Term","Unique Landscape Term (inc. BNG Code)","BNG Habitat","Distinctiveness"]
[null,"Coastal saltmarsh ","Saltmarsh","Saltmarsh - A2.5","Saltmarshes and saline reedbeds","Medium"]
[null,"Cropland","Cropland","Arable - c1c","Cereal crops","Low"]
[{"$nulls":3},"Arable - c1c7","Cereal crops other","Low"]
[{"$nulls":3},"Arable - c1d","Non-cereal crops","Low"]
[{"$nulls":3},"Arable - c1b","Temporary grass and clover leys","Low"]
[null,null,"Cropland margins","Arable - c1a7","Arable field margins cultivated annually","Medium"]
[{"$nulls":3},"Arable - c1a8","Arable field margins game bird mix","Medium"]
[{"$nulls":3},"Arable - c1a6","Arable field margins pollen & nectar","Medium"]
[{"$nulls":3},"Arable - c1a","Arable field margins tussocky","Medium"]
[{"$nulls":3},"Arable - c1c5","Cereal crops winter stubble","Medium"]
[null,null,"Horticulture","Horticulture - c1f","Horticulture","Low"]
[null,null,"Orchard","Orchard - c1e","Intensive orchards","Low"]
[null,"grassland","Amenity Grassland","Amenity Grassland - g4","Modified grassland","Low"]
[null,null,"Bracken","Bracken - g1c","Bracken","Low"]
[null,null,"Meadow Grassland","Meadow Grassland - g1d","Other lowland acid grassland","Medium"]
[{"$nulls":3},"Meadow Grassland - g3c","Other neutral grassland","Medium"]
[{"$nulls":3},"Meadow Grassland - g1b","Upland acid grassland","Medium"]
[null,"Heathland and shrub","Invasive Scrub","Invasive Scrub - h3g","Rhododendron scrub","Low"]
[null,null,"Native Scrub","Native Scrub - h3a","Blackthorn scrub","Medium"]
[{"$nulls":3},"Native Scrub - h3d","Bramble scrub","Medium"]
[{"$nulls":3},"Native Scrub - h3e","Gorse scrub","Medium"]
[{"$nulls":3},"Native Scrub - h3f","Hawthorn scrub","Medium"]
[{"$nulls":3},"Native Scrub - h3b","Hazel scrub","Medium"]
[{"$nulls":3},"Native Scrub - h3h","Mixed scrub","Medium"]
[{"$nulls":3},"Native Scrub - h3cNE2","Sea buckthorn scrub (other)","Medium"]
[null,"Hedgerow","Native Hedge","Native Hedge - h2NE5","Native Hedgerow","Low"]
[{"$nulls":3},"Native Hedge - h2NE2","Native Species Rich Hedgerow","Medium"]
[{"$nulls":3},"Native Hedge - h2NE9","Native Hedgerow - Associated with bank or ditch","Medium"]
[null,null,"Native Hedge with Standard Trees","Native Hedge with Standard Trees - h2NE4","Native Hedgerow with trees","Low"]
[{"$nulls":3},"Native Hedge with Standard Trees - h2NE1","Native Species Rich Hedgerow with trees","Medium"]
[{"$nulls":3},"Native Hedge with Standard Trees - h2NE8","Native Hedgerow with trees - Associated with bank or ditch","Medium"]
[null,null,"Ornamental Hedge","Ornamental Hedge - h2NE3","Hedge Ornamental Non Native","V.Low"]
[null,null,"Standard Trees","Standard Trees - w1g6NE4","Line of Trees - Associated with bank or ditch","Low"]
[{"$nulls":3},"Standard Trees - w1g6NE2","Line of Trees","Low"]
[{"$nulls":3},"Standard Trees - w1g6NE1","Line of Trees (Ecologically Valuable) - with Bank or Ditch","Medium"]
[{"$nulls":3},"Standard Trees - w1g6NE3","Line of Trees (Ecologically Valuable)","Medium"]
[null,"Intertidal Hard Structures","INTERTIDAL TBC","INTERTIDAL TBC - ART_A1.4","Artificial features of hard structures","low"]
[null,null,"INTERTIDAL TBC","INTERTIDAL TBC - ART_A1","Artificial hard structures","low"]
[null,null,"INTERTIDAL TBC","INTERTIDAL TBC - ART_A1_IGGI","Artificial hard structures with Integrated Greening of Grey Infrastructure (IGGI)","Medium"]
[null,"Intertidal sediment","INTERTIDAL TBC","INTERTIDAL TBC - ART_A2.7","Artificial littoral biogenic reefs","low"]
[null,null,"INTERTIDAL TBC","INTERTIDAL TBC - ART_A2.1","Artificial littoral coarse sediment","low"]
[null,null,"INTERTIDAL TBC","INTERTIDAL TBC - ART_A2.4","Artificial littoral mixed sediments","low"]
[null,null,"INTERTIDAL TBC","INTERTIDAL TBC - ART_A2.3","Artificial littoral mud","Low"]
[null,null,"INTERTIDAL TBC","INTERTIDAL TBC - ART_A2.24","Artificial littoral muddy sand","low"]
[null,null,"INTERTIDAL TBC","INTERTIDAL TBC - ART_A2.21","Artificial littoral sand","Low"]
[null,null,"INTERTIDAL TBC","INTERTIDAL TBC - ART_A2.6","Artificial littoral seagrass","low"]
[null,null,"INTERTIDAL TBC","INTERTIDAL TBC - A2.4","Littoral mixed sediments","Low"]
[null,null,"INTERTIDAL TBC","INTERTIDAL TBC - A2.24","Littoral muddy sand","Medium"]
[null,null,"INTERTIDAL TBC","INTERTIDAL TBC - A2.21","Littoral sand","Medium"]
[null,"Lakes","Reservoirs","Reservoirs - 108","Reservoirs","Medium"]
[null,null,"Wildlfe Pond","Wildlfe Pond - r1b","Ponds (Non- Priority Habitat)","Medium"]
[null,"Rivers & Streams","Canal","Canal - r1eNE1","Canals","Medium"]
[null,null,"Culvert","Culvert - rNE1","Culvert","Low"]
[null,null,"Ditch","Ditch - r1eNE2","Ditches","Medium"]
[null,"Sparsely vegetated land","Ruderals","Ruderals - 17","Ruderal/Ephemeral","Low"]
[null,null,"Scree","Scree - s1d","Other inland rock and scree","Medium"]
[null,"Urban","Allotments","Allotments - 910","Allotments","Low"]
[null,null,"Bareground","Bareground - 350","Vacant/derelict land/ bareground","Low"]
[null,null,"Biodiverse Roof","Biodiverse Roof - 1113","Brown roof","Medium"]
[null,null,"Bioswale","Bioswale - 1191","Bioswale","Low"]
[null,null,"Cemetery","Cemetery - 800","Cemeteries and churchyards","Medium"]
[null,null,"Garden","Garden - 231","Vegetated garden","Low"]
[{"$nulls":3},"Garden - 232","Un-vegetated garden","V.Low"]
[null,null,"Green Roof","Green Roof - 1111","Extensive green roof","Medium"]
[null,null,"Green Roof - Sedum","Green Roof - Sedum - 1112","Intensive green roof","Low"]
[null,null,"Green Wall","Green Wall - 1122","Facade-bound green wall","Low"]
[{"$nulls":3},"Green Wall - 1121","Ground based green wall","Low"]
[null,null,"Impermeable Hardscape","Impermeable Hardscape - u1b","Developed land; sealed surface","V.Low"]
[null,null,"Ornamental Pond","Ornamental Pond - 362","Ornamental lake or pond","Low"]
[null,null,"Ornamental Shrub Planting","Ornamental Shrub Planting - 1160","Introduced shrub","Low"]
[null,null,"Permeable Hardscape","Permeable Hardscape - u1c","Artificial unvegetated, unsealed surface","V.Low"]
[null,null,"Planters","Planters - 1140","Ground level planters","Low"]
[null,null,"Quarry","Quarry - 1030","Sand pit quarry or open cast mine","Low"]
[null,null,"Standard Tree","Standard Tree - 1170","Urban Tree","Low"]
[null,null,"SUDS","SUDS - 1192","Rain garden","Low"]
[{"$nulls":3},"SUDS - 1119","Sustainable urban drainage feature","Low"]
[null,null,"Wall","Wall - u1e","Built linear features","V.Low"]
[null,"Woodland and forest","Conifer Woodland","Conifer Woodland - w2c","Other coniferous woodland","Low"]
[{"$nulls":3},"Conifer Woodland - w2b","Other Scot's Pine woodland","Medium"]
[null,null,"Native Broadleaved Woodland","Native Broadleaved Woodland - w1g","Other woodland; broadleaved","Medium"]
[null,null,"Native Mixed Woodland","Native Mixed Woodland - w1h","Other woodland; mixed","Medium"]